{"text_format":"1","workbook":"xlsx","n_sheets":4,"sheets":["FADS v2.0","Sheet2","Sheet3","Release Notes"],"not_rendered":{"charts":0,"images":1,"macros":1,"external_links":0,"defined_names":4,"comments":1,"pivot_tables":0},"unopened":[],"bounds":{"document_bytes":16777216,"sheet_cells":100000,"rows_first":2000,"rows_last":500,"rows_between":2000,"halvings":0,"cell_chars":16384,"cell_head_chars":4096},"cells_cut":0,"cells_raw":0,"read":"whole","date_system":"1900"}

{"sheet":"FADS v2.0","index":0,"n_rows":526,"n_cols":14,"rows_kept":526,"cut":false,"hidden":false,"merged":[[14,1,14,2],[15,1,15,2],[18,1,18,13],[12,1,12,2],[13,1,13,2],[5,1,5,13],[6,1,6,13],[8,1,8,13],[9,1,9,13],[11,1,11,13],[26,1,26,2],[27,1,27,2],[20,1,20,2],[16,1,16,2],[21,1,21,2],[22,1,22,2],[19,1,19,2],[71,1,71,13],[31,1,31,2],[32,1,32,2],[33,1,33,2],[34,1,34,2],[35,1,35,2],[28,1,28,2],[29,1,29,2],[30,1,30,2],[36,1,36,2],[38,1,38,13],[23,1,23,2],[25,1,25,2],[24,1,24,2]]}
[]
[]
[]
[]
[]
[null,"Year of Draft"]
[]
[]
[null,"FADS Worksheet Type"]
[null,1]
[]
[null,"League Information"]
[null,"MFL League ID"]
[null,{"$f":"\"Amount of Bench Spots to Bid Upon (League Minimum - \"&IFERROR(D22-D21,\"0\")&\")\"","v":"Amount of Bench Spots to Bid Upon (League Minimum - 0)"}]
[null,"Amount Withheld for Waiver Wire/Emergency Fund"]
[null,"Percentage to Allocate to Starting Lineup",null,null,{"$f":"IF(E17=\"\",\"\",1-E17)","v":{"$error":"#VALUE!"}},null,null,null,{"$f":"IFERROR(ROUND(IF(B10=1,IF(E23*E17>D25*D21,E23*E16, E23-I17),IF(B10=2,E23*D16,IF(B10=3,E23*D16,))),D25),\"\")","v":""}]
[null,"Percentage to Allocate to Bench",null,null,{"$f":"IF(B$10=1,D25*D21/D23,\"\")","v":{"$error":"#VALUE!"}},null,null,null,{"$f":"IFERROR(IF(B10=1,IF(E23*E17>D25*D21,E23*E17, D25*D21),IF(B10=2,E23*D17,IF(B10=3,E23*D17,))),\"\")","v":""},{"$f":"IF(OR(D16=\"\",D17=\"\"),\"\",IF(D16+D17=100%,\"\",\"Percentage to Allocate to Starting Lineup plus Percentage to Allocate to Bench must total 100%!!\"))","v":""}]
[]
[null,"Inferred Information"]
[null,"Starting Lineup Spots",null,{"$f":"IF(Sheet3!AS1>0,Sheet3!AS1,\"\")","v":""},{"$f":"D20","v":""}]
[null,"Minimum Bench Spots",null,{"$f":"IF(Sheet3!AW1>0,Sheet3!AW1,\"\")","v":""}]
[null,"Total Roster Spots",null,{"$f":"IF(Sheet3!AU1>0,Sheet3!AU1,\"\")","v":""}]
[null,"Salary Cap",null,{"$f":"IF(Sheet3!AY1>0,Sheet3!AY1,\"\")","v":""},{"$f":"D23-D15","v":{"$error":"#VALUE!"}}]
[null,"Minimum Bid Allowed",null,{"$f":"IF(Sheet3!AQ1>0,Sheet3!AQ1,\"\")","v":""}]
[null,"Minimum Opening Bid",null,{"$f":"IF(Sheet3!AO1>0,Sheet3!AO1,\"\")","v":""}]
[null,"Primary Salary Cap Accolcation Amount Remaining",null,{"$f":"IFERROR(IF(I16-(SUM(N41:N70)+SUM(M41:M70))=0,\"\",I16-(SUM(N41:N70)+SUM(M41:M70))),\"\")","v":""}]
[null,"Bench Salary Cap Accolcation Amount Remaining",null,{"$f":"IFERROR(IF(I17-(SUM(N74:N144)+SUM(M74:M144))=0,\"\",I17-(SUM(N74:N144)+SUM(M74:M144))),\"\")","v":""}]
[null,"Amount Allocatable Per Bench Spot",null,{"$f":"IF(D21=0,\"\",IF(D14=0,\"\",IF(B10=1,D25,IF(B10=2,I17/D21,IF(B10=3,I17/D14,\"\")))))","v":""}]
[null,"Number of Starting Lineup Players Added",null,{"$f":"COUNT(D41:D70)","v":0}]
[null,"Number of Bench Players Added",null,{"$f":"COUNT(D74:D144)","v":0}]
[null,"Total Points of Starting Lineup Players Selected",null,{"$f":"SUM(D41:D70)","v":0},{"$f":"SUM(E41:E70)","v":0}]
[null,"Total Points of Bench Players Selected",null,{"$f":"SUM(D74:D144)","v":0},{"$f":"SUM(E74:E144)","v":0}]
[null,"Average Remaining Per Player (Starting Lineup)",null,{"$f":"IFERROR((D26-SUM(N39:N70))/(D20-D29),\"\")","v":""}]
[null,"Average Remaining Per Player (Bench)",null,{"$f":"IFERROR((D27-SUM(N40:N71))/(D21-D30),\"\")","v":""}]
[null,"Starting Lineup Points vs. Salary",null,{"$f":"IFERROR(TRUNC(((D31/(D31+D32))*100),1)&\"% - \"&TRUNC(((D26/D23)*100),1)&\"%\",\"\")","v":""}]
[null,"Bench Points vs. Salary",null,{"$f":"IFERROR(TRUNC(((D32/(D31+D32))*100),1)&\"% - \"&TRUNC(((D27/D23)*100),1)&\"%\",\"\")","v":""}]
[null,"Average Remaining Per Player (All)",null,{"$f":"IFERROR((E23-SUM(N41:N144))/(D22-(D29+D30)),\"\")","v":""}]
[]
[null,"Starting Lineup Player Selection & Output"]
[null,"Pick?","Player","Score",null,null,null,"Projection Override","Recommended Percentage of Remaining Total","Actual Percentage of Primary Salary Allocation","Salary Cap Amount to Allocate",null,"Amount Override","Amount Spent on Player"]
[null,{"$f":"IF(D20=\"\",\"\",IF(D20>0,\"►\",\"\"))","v":""},1,null,{"$f":"IF(N41=\"\",IF(M41=\"\",IF(H41=\"\",D41,H41),\"\"),\"\")","v":0},{"$f":"IF(C41=\"\",\"\",INDEX(Sheet3!$AA$10:$AA$1471,'FADS v2.0'!C41,1))","v":0},{"$f":"INDEX(Sheet3!$AA$10:$AC$1471,'FADS v2.0'!C41,3)","v":0},null,{"$f":"IF(H41=\"\",IF(E41=\"\",\"\",IF(D41=\"\",\"\",E41/$E$31)),IF(E41=\"\",\"\",IF(H41=\"\",\"\",E41/$E$31)))","v":""},{"$f":"IF(N41=\"\",IF(M41=\"\",\"\",M41/$I$16),N41/$I$16)","v":""},{"$f":"IF(M41=\"\",IF(N41=\"\",IF(H41=\"\",IF(D41=\"\",\"\",IF($D$26=\"\",\"\",$D$26*I41)),$D$26*I41),\"\"),\"\")","v":""},{"$f":"IF(D41=\"\",\"\",$I$16*I41)","v":""}]
[null,{"$f":"IF(D20=\"\",\"\",IF(D20>1,\"►\",\"\"))","v":""},1,{"$f":"IF(H42=\"\",IF(C42=1,\"\",VLOOKUP(F42,Sheet3!$C$11:$D$1471,2,FALSE)),\"\")","v":""},"",{"$f":"IF(C42=\"\",\"\",INDEX(Sheet3!$AA$10:$AA$1471,'FADS v2.0'!C42,1))","v":0},{"$f":"INDEX(Sheet3!$AA$10:$AC$1471,'FADS v2.0'!C42,3)","v":0},null,"","",{"$f":"IF(M42=\"\",IF(N42=\"\",IF(H42=\"\",IF(D42=\"\",\"\",IF($D$26=\"\",\"\",$D$26*I42)),$D$26*I42),\"\"),\"\")","v":""},""]
[null,{"$f":"IF(D20=\"\",\"\",IF(D20>2,\"►\",\"\"))","v":""},1,{"$f":"IF(H43=\"\",IF(C43=1,\"\",VLOOKUP(F43,Sheet3!$C$11:$D$1471,2,FALSE)),\"\")","v":""},"",{"$f":"IF(C43=\"\",\"\",INDEX(Sheet3!$AA$10:$AA$1471,'FADS v2.0'!C43,1))","v":0},{"$f":"INDEX(Sheet3!$AA$10:$AC$1471,'FADS v2.0'!C43,3)","v":0},null,"","",{"$f":"IF(M43=\"\",IF(N43=\"\",IF(H43=\"\",IF(D43=\"\",\"\",IF($D$26=\"\",\"\",$D$26*I43)),$D$26*I43),\"\"),\"\")","v":""},""]
[null,{"$f":"IF(D20=\"\",\"\",IF(D20>3,\"►\",\"\"))","v":""},1,{"$f":"IF(H44=\"\",IF(C44=1,\"\",VLOOKUP(F44,Sheet3!$C$11:$D$1471,2,FALSE)),\"\")","v":""},"",{"$f":"IF(C44=\"\",\"\",INDEX(Sheet3!$AA$10:$AA$1471,'FADS v2.0'!C44,1))","v":0},{"$f":"INDEX(Sheet3!$AA$10:$AC$1471,'FADS v2.0'!C44,3)","v":0},null,"","","",""]
[null,{"$f":"IF(D20=\"\",\"\",IF(D20>4,\"►\",\"\"))","v":""},1,{"$f":"IF(H45=\"\",IF(C45=1,\"\",VLOOKUP(F45,Sheet3!$C$11:$D$1471,2,FALSE)),\"\")","v":""},"",{"$f":"IF(C45=\"\",\"\",INDEX(Sheet3!$AA$10:$AA$1471,'FADS v2.0'!C45,1))","v":0},{"$f":"INDEX(Sheet3!$AA$10:$AC$1471,'FADS v2.0'!C45,3)","v":0},null,"","","",""]
[null,{"$f":"IF(D20=\"\",\"\",IF(D20>5,\"►\",\"\"))","v":""},1,{"$f":"IF(H46=\"\",IF(C46=1,\"\",VLOOKUP(F46,Sheet3!$C$11:$D$1471,2,FALSE)),\"\")","v":""},{"$f":"IF(N46=\"\",IF(M46=\"\",IF(H46=\"\",D46,H46),\"\"),\"\")","v":""},{"$f":"IF(C46=\"\",\"\",INDEX(Sheet3!$AA$10:$AA$1471,'FADS v2.0'!C46,1))","v":0},{"$f":"INDEX(Sheet3!$AA$10:$AC$1471,'FADS v2.0'!C46,3)","v":0},null,"","","",""]
[null,{"$f":"IF(D20=\"\",\"\",IF(D20>6,\"►\",\"\"))","v":""},1,{"$f":"IF(H47=\"\",IF(C47=1,\"\",VLOOKUP(F47,Sheet3!$C$11:$D$1471,2,FALSE)),\"\")","v":""},"",{"$f":"IF(C47=\"\",\"\",INDEX(Sheet3!$AA$10:$AA$1471,'FADS v2.0'!C47,1))","v":0},{"$f":"INDEX(Sheet3!$AA$10:$AC$1471,'FADS v2.0'!C47,3)","v":0},null,"","","",""]
[null,{"$f":"IF(D20=\"\",\"\",IF(D20>7,\"►\",\"\"))","v":""},1,{"$f":"IF(H48=\"\",IF(C48=1,\"\",VLOOKUP(F48,Sheet3!$C$11:$D$1471,2,FALSE)),\"\")","v":""},"",{"$f":"IF(C48=\"\",\"\",INDEX(Sheet3!$AA$10:$AA$1471,'FADS v2.0'!C48,1))","v":0},{"$f":"INDEX(Sheet3!$AA$10:$AC$1471,'FADS v2.0'!C48,3)","v":0},null,"","","",""]
[null,{"$f":"IF(D20=\"\",\"\",IF(D20>8,\"►\",\"\"))","v":""},1,{"$f":"IF(H49=\"\",IF(C49=1,\"\",VLOOKUP(F49,Sheet3!$C$11:$D$1471,2,FALSE)),\"\")","v":""},"",{"$f":"IF(C49=\"\",\"\",INDEX(Sheet3!$AA$10:$AA$1471,'FADS v2.0'!C49,1))","v":0},{"$f":"INDEX(Sheet3!$AA$10:$AC$1471,'FADS v2.0'!C49,3)","v":0},null,"","","",""]
[null,{"$f":"IF(D20=\"\",\"\",IF(D20>9,\"►\",\"\"))","v":""},1,{"$f":"IF(H50=\"\",IF(C50=1,\"\",VLOOKUP(F50,Sheet3!$C$11:$D$1471,2,FALSE)),\"\")","v":""},"",{"$f":"IF(C50=\"\",\"\",INDEX(Sheet3!$AA$10:$AA$1471,'FADS v2.0'!C50,1))","v":0},{"$f":"INDEX(Sheet3!$AA$10:$AC$1471,'FADS v2.0'!C50,3)","v":0},null,"","","",""]
[null,{"$f":"IF(D20=\"\",\"\",IF(D20>10,\"►\",\"\"))","v":""},1,{"$f":"IF(H51=\"\",IF(C51=1,\"\",VLOOKUP(F51,Sheet3!$C$11:$D$1471,2,FALSE)),\"\")","v":""},"",{"$f":"IF(C51=\"\",\"\",INDEX(Sheet3!$AA$10:$AA$1471,'FADS v2.0'!C51,1))","v":0},{"$f":"INDEX(Sheet3!$AA$10:$AC$1471,'FADS v2.0'!C51,3)","v":0},null,"","","",""]
[null,{"$f":"IF(D20=\"\",\"\",IF(D20>11,\"►\",\"\"))","v":""},1,{"$f":"IF(H52=\"\",IF(C52=1,\"\",VLOOKUP(F52,Sheet3!$C$11:$D$1471,2,FALSE)),\"\")","v":""},"",{"$f":"IF(C52=\"\",\"\",INDEX(Sheet3!$AA$10:$AA$1471,'FADS v2.0'!C52,1))","v":0},{"$f":"INDEX(Sheet3!$AA$10:$AC$1471,'FADS v2.0'!C52,3)","v":0},null,"","","",""]
[null,{"$f":"IF(D20=\"\",\"\",IF(D20>12,\"►\",\"\"))","v":""},1,{"$f":"IF(H53=\"\",IF(C53=1,\"\",VLOOKUP(F53,Sheet3!$C$11:$D$1471,2,FALSE)),\"\")","v":""},"",{"$f":"IF(C53=\"\",\"\",INDEX(Sheet3!$AA$10:$AA$1471,'FADS v2.0'!C53,1))","v":0},{"$f":"INDEX(Sheet3!$AA$10:$AC$1471,'FADS v2.0'!C53,3)","v":0},null,"","","",""]
[null,{"$f":"IF(D20=\"\",\"\",IF(D20>13,\"►\",\"\"))","v":""},1,{"$f":"IF(H54=\"\",IF(C54=1,\"\",VLOOKUP(F54,Sheet3!$C$11:$D$1471,2,FALSE)),\"\")","v":""},"",{"$f":"IF(C54=\"\",\"\",INDEX(Sheet3!$AA$10:$AA$1471,'FADS v2.0'!C54,1))","v":0},{"$f":"INDEX(Sheet3!$AA$10:$AC$1471,'FADS v2.0'!C54,3)","v":0},null,"","","",""]
[null,{"$f":"IF(D20=\"\",\"\",IF(D20>14,\"►\",\"\"))","v":""},1,{"$f":"IF(H55=\"\",IF(C55=1,\"\",VLOOKUP(F55,Sheet3!$C$11:$D$1471,2,FALSE)),\"\")","v":""},"",{"$f":"IF(C55=\"\",\"\",INDEX(Sheet3!$AA$10:$AA$1471,'FADS v2.0'!C55,1))","v":0},{"$f":"INDEX(Sheet3!$AA$10:$AC$1471,'FADS v2.0'!C55,3)","v":0},null,"","","",""]
[null,{"$f":"IF(D20=\"\",\"\",IF(D20>15,\"►\",\"\"))","v":""},1,{"$f":"IF(H56=\"\",IF(C56=1,\"\",VLOOKUP(F56,Sheet3!$C$11:$D$1471,2,FALSE)),\"\")","v":""},"",{"$f":"IF(C56=\"\",\"\",INDEX(Sheet3!$AA$10:$AA$1471,'FADS v2.0'!C56,1))","v":0},{"$f":"INDEX(Sheet3!$AA$10:$AC$1471,'FADS v2.0'!C56,3)","v":0},null,"","","",""]
[null,{"$f":"IF(D20=\"\",\"\",IF(D20>16,\"►\",\"\"))","v":""},1,{"$f":"IF(H57=\"\",IF(C57=1,\"\",VLOOKUP(F57,Sheet3!$C$11:$D$1471,2,FALSE)),\"\")","v":""},"",{"$f":"IF(C57=\"\",\"\",INDEX(Sheet3!$AA$10:$AA$1471,'FADS v2.0'!C57,1))","v":0},{"$f":"INDEX(Sheet3!$AA$10:$AC$1471,'FADS v2.0'!C57,3)","v":0},null,"","","",""]
[null,{"$f":"IF(D20=\"\",\"\",IF(D20>17,\"►\",\"\"))","v":""},1,{"$f":"IF(H58=\"\",IF(C58=1,\"\",VLOOKUP(F58,Sheet3!$C$11:$D$1471,2,FALSE)),\"\")","v":""},"",{"$f":"IF(C58=\"\",\"\",INDEX(Sheet3!$AA$10:$AA$1471,'FADS v2.0'!C58,1))","v":0},{"$f":"INDEX(Sheet3!$AA$10:$AC$1471,'FADS v2.0'!C58,3)","v":0},null,"","","",""]
[null,{"$f":"IF(D20=\"\",\"\",IF(D20>18,\"►\",\"\"))","v":""},1,{"$f":"IF(H59=\"\",IF(C59=1,\"\",VLOOKUP(F59,Sheet3!$C$11:$D$1471,2,FALSE)),\"\")","v":""},"",{"$f":"IF(C59=\"\",\"\",INDEX(Sheet3!$AA$10:$AA$1471,'FADS v2.0'!C59,1))","v":0},{"$f":"INDEX(Sheet3!$AA$10:$AC$1471,'FADS v2.0'!C59,3)","v":0},null,"","","",""]
[null,{"$f":"IF(D20=\"\",\"\",IF(D20>19,\"►\",\"\"))","v":""},1,{"$f":"IF(H60=\"\",IF(C60=1,\"\",VLOOKUP(F60,Sheet3!$C$11:$D$1471,2,FALSE)),\"\")","v":""},"",{"$f":"IF(C60=\"\",\"\",INDEX(Sheet3!$AA$10:$AA$1471,'FADS v2.0'!C60,1))","v":0},{"$f":"INDEX(Sheet3!$AA$10:$AC$1471,'FADS v2.0'!C60,3)","v":0},null,"","","",""]
[null,{"$f":"IF(D20=\"\",\"\",IF(D20>20,\"►\",\"\"))","v":""},1,{"$f":"IF(H61=\"\",IF(C61=1,\"\",VLOOKUP(F61,Sheet3!$C$11:$D$1471,2,FALSE)),\"\")","v":""},"",{"$f":"IF(C61=\"\",\"\",INDEX(Sheet3!$AA$10:$AA$1471,'FADS v2.0'!C61,1))","v":0},{"$f":"INDEX(Sheet3!$AA$10:$AC$1471,'FADS v2.0'!C61,3)","v":0},null,"","","",""]
[null,{"$f":"IF(D20=\"\",\"\",IF(D20>21,\"►\",\"\"))","v":""},1,{"$f":"IF(H62=\"\",IF(C62=1,\"\",VLOOKUP(F62,Sheet3!$C$11:$D$1471,2,FALSE)),\"\")","v":""},"",{"$f":"IF(C62=\"\",\"\",INDEX(Sheet3!$AA$10:$AA$1471,'FADS v2.0'!C62,1))","v":0},{"$f":"INDEX(Sheet3!$AA$10:$AC$1471,'FADS v2.0'!C62,3)","v":0},null,"","","",""]
[null,{"$f":"IF(D20=\"\",\"\",IF(D20>22,\"►\",\"\"))","v":""},1,{"$f":"IF(H63=\"\",IF(C63=1,\"\",VLOOKUP(F63,Sheet3!$C$11:$D$1471,2,FALSE)),\"\")","v":""},"",{"$f":"IF(C63=\"\",\"\",INDEX(Sheet3!$AA$10:$AA$1471,'FADS v2.0'!C63,1))","v":0},{"$f":"INDEX(Sheet3!$AA$10:$AC$1471,'FADS v2.0'!C63,3)","v":0},null,"","","",""]
[null,{"$f":"IF(D20=\"\",\"\",IF(D20>23,\"►\",\"\"))","v":""},1,{"$f":"IF(H64=\"\",IF(C64=1,\"\",VLOOKUP(F64,Sheet3!$C$11:$D$1471,2,FALSE)),\"\")","v":""},"",{"$f":"IF(C64=\"\",\"\",INDEX(Sheet3!$AA$10:$AA$1471,'FADS v2.0'!C64,1))","v":0},{"$f":"INDEX(Sheet3!$AA$10:$AC$1471,'FADS v2.0'!C64,3)","v":0},null,"","","",""]
[null,{"$f":"IF(D20=\"\",\"\",IF(D20>24,\"►\",\"\"))","v":""},1,{"$f":"IF(H65=\"\",IF(C65=1,\"\",VLOOKUP(F65,Sheet3!$C$11:$D$1471,2,FALSE)),\"\")","v":""},"",{"$f":"IF(C65=\"\",\"\",INDEX(Sheet3!$AA$10:$AA$1471,'FADS v2.0'!C65,1))","v":0},{"$f":"INDEX(Sheet3!$AA$10:$AC$1471,'FADS v2.0'!C65,3)","v":0},null,"","","",""]
[null,{"$f":"IF(D20=\"\",\"\",IF(D20>25,\"►\",\"\"))","v":""},1,{"$f":"IF(H66=\"\",IF(C66=1,\"\",VLOOKUP(F66,Sheet3!$C$11:$D$1471,2,FALSE)),\"\")","v":""},"",{"$f":"IF(C66=\"\",\"\",INDEX(Sheet3!$AA$10:$AA$1471,'FADS v2.0'!C66,1))","v":0},{"$f":"INDEX(Sheet3!$AA$10:$AC$1471,'FADS v2.0'!C66,3)","v":0},null,"","","",""]
[null,{"$f":"IF(D20=\"\",\"\",IF(D20>26,\"►\",\"\"))","v":""},1,{"$f":"IF(H67=\"\",IF(C67=1,\"\",VLOOKUP(F67,Sheet3!$C$11:$D$1471,2,FALSE)),\"\")","v":""},"",{"$f":"IF(C67=\"\",\"\",INDEX(Sheet3!$AA$10:$AA$1471,'FADS v2.0'!C67,1))","v":0},{"$f":"INDEX(Sheet3!$AA$10:$AC$1471,'FADS v2.0'!C67,3)","v":0},null,"","","",""]
[null,{"$f":"IF(D20=\"\",\"\",IF(D20>27,\"►\",\"\"))","v":""},1,{"$f":"IF(H68=\"\",IF(C68=1,\"\",VLOOKUP(F68,Sheet3!$C$11:$D$1471,2,FALSE)),\"\")","v":""},"",{"$f":"IF(C68=\"\",\"\",INDEX(Sheet3!$AA$10:$AA$1471,'FADS v2.0'!C68,1))","v":0},{"$f":"INDEX(Sheet3!$AA$10:$AC$1471,'FADS v2.0'!C68,3)","v":0},null,"","","",""]
[null,{"$f":"IF(D20=\"\",\"\",IF(D20>28,\"►\",\"\"))","v":""},1,{"$f":"IF(H69=\"\",IF(C69=1,\"\",VLOOKUP(F69,Sheet3!$C$11:$D$1471,2,FALSE)),\"\")","v":""},"",{"$f":"IF(C69=\"\",\"\",INDEX(Sheet3!$AA$10:$AA$1471,'FADS v2.0'!C69,1))","v":0},{"$f":"INDEX(Sheet3!$AA$10:$AC$1471,'FADS v2.0'!C69,3)","v":0},null,"","","",""]
[null,{"$f":"IF(D20=\"\",\"\",IF(D20>29,\"►\",\"\"))","v":""},1,{"$f":"IF(H70=\"\",IF(C70=1,\"\",VLOOKUP(F70,Sheet3!$C$11:$D$1471,2,FALSE)),\"\")","v":""},{"$f":"IF(N70=\"\",IF(M70=\"\",IF(H70=\"\",D70,H70),\"\"),\"\")","v":""},{"$f":"IF(C70=\"\",\"\",INDEX(Sheet3!$AA$10:$AA$1471,'FADS v2.0'!C70,1))","v":0},{"$f":"INDEX(Sheet3!$AA$10:$AC$1471,'FADS v2.0'!C70,3)","v":0},null,"","",{"$f":"IF(M70=\"\",IF(N70=\"\",IF(H70=\"\",IF(D70=\"\",\"\",IF($D$26=\"\",\"\",$D$26*I70)),$D$26*I70),\"\"),\"\")","v":""},""]
[]
[null,"Bench Player Selection & Output"]
[null,"Pick?","Player","Score",null,null,null,"Projection Override","Recommended Percentage of Remaining Total","Actual Percentage of Primary Salary Allocation","Salary Cap Amount to Allocate",null,"Amount Override","Amount Spent on Player"]
[null,{"$f":"IF(D14>0,\"►\",\"\")","v":""},5,null,0,{"$f":"IF(C74=\"\",\"\",INDEX(Sheet3!$AA$10:$AA$1471,'FADS v2.0'!C74,1))","v":"Adams, Joe CAR WR"},{"$f":"INDEX(Sheet3!$AA$10:$AC$1471,'FADS v2.0'!C74,3)","v":0},null,{"$f":"IF(H74=\"\",IF(E74=\"\",\"\",IF(D74=\"\",\"\",E74/$E$32)),IF(E74=\"\",\"\",IF(H74=\"\",\"\",E74/$E$32)))","v":""},{"$f":"IF(N74=\"\",IF(M74=\"\",\"\",M74/$I$17),N74/$I$17)","v":""},{"$f":"IF(M74=\"\",IF(N74=\"\",IF(H74=\"\",IF(D74=\"\",\"\",IF($D$27=\"\",\"\",$D$27*I74)),$D$27*I74),\"\"),\"\")","v":""},{"$f":"IF(D74=\"\",\"\",$I$17*I74)","v":""}]
[null,{"$f":"IF(D14>1,\"►\",\"\")","v":""},1,{"$f":"IF(H75=\"\",IF(C75=1,\"\",VLOOKUP(F75,Sheet3!$C$11:$D$1471,2,FALSE)),\"\")","v":""},"",{"$f":"IF(C75=\"\",\"\",INDEX(Sheet3!$AA$10:$AA$1471,'FADS v2.0'!C75,1))","v":0},{"$f":"INDEX(Sheet3!$AA$10:$AC$1471,'FADS v2.0'!C75,3)","v":0},null,"","","",""]
[null,{"$f":"IF(D14>2,\"►\",\"\")","v":""},1,{"$f":"IF(H76=\"\",IF(C76=1,\"\",VLOOKUP(F76,Sheet3!$C$11:$D$1471,2,FALSE)),\"\")","v":""},"",{"$f":"IF(C76=\"\",\"\",INDEX(Sheet3!$AA$10:$AA$1471,'FADS v2.0'!C76,1))","v":0},{"$f":"INDEX(Sheet3!$AA$10:$AC$1471,'FADS v2.0'!C76,3)","v":0},null,"","","",""]
[null,{"$f":"IF(D14>3,\"►\",\"\")","v":""},1,{"$f":"IF(H77=\"\",IF(C77=1,\"\",VLOOKUP(F77,Sheet3!$C$11:$D$1471,2,FALSE)),\"\")","v":""},"",{"$f":"IF(C77=\"\",\"\",INDEX(Sheet3!$AA$10:$AA$1471,'FADS v2.0'!C77,1))","v":0},{"$f":"INDEX(Sheet3!$AA$10:$AC$1471,'FADS v2.0'!C77,3)","v":0},null,"","","",""]
[null,{"$f":"IF(D14>4,\"►\",\"\")","v":""},1,{"$f":"IF(H78=\"\",IF(C78=1,\"\",VLOOKUP(F78,Sheet3!$C$11:$D$1471,2,FALSE)),\"\")","v":""},"",{"$f":"IF(C78=\"\",\"\",INDEX(Sheet3!$AA$10:$AA$1471,'FADS v2.0'!C78,1))","v":0},{"$f":"INDEX(Sheet3!$AA$10:$AC$1471,'FADS v2.0'!C78,3)","v":0},null,"","","",""]
[null,{"$f":"IF(D14>5,\"►\",\"\")","v":""},1,{"$f":"IF(H79=\"\",IF(C79=1,\"\",VLOOKUP(F79,Sheet3!$C$11:$D$1471,2,FALSE)),\"\")","v":""},"",{"$f":"IF(C79=\"\",\"\",INDEX(Sheet3!$AA$10:$AA$1471,'FADS v2.0'!C79,1))","v":0},{"$f":"INDEX(Sheet3!$AA$10:$AC$1471,'FADS v2.0'!C79,3)","v":0},null,"","","",""]
[null,{"$f":"IF(D14>6,\"►\",\"\")","v":""},1,{"$f":"IF(H80=\"\",IF(C80=1,\"\",VLOOKUP(F80,Sheet3!$C$11:$D$1471,2,FALSE)),\"\")","v":""},"",{"$f":"IF(C80=\"\",\"\",INDEX(Sheet3!$AA$10:$AA$1471,'FADS v2.0'!C80,1))","v":0},{"$f":"INDEX(Sheet3!$AA$10:$AC$1471,'FADS v2.0'!C80,3)","v":0},null,"","","",""]
[null,{"$f":"IF(D14>7,\"►\",\"\")","v":""},1,{"$f":"IF(H81=\"\",IF(C81=1,\"\",VLOOKUP(F81,Sheet3!$C$11:$D$1471,2,FALSE)),\"\")","v":""},"",{"$f":"IF(C81=\"\",\"\",INDEX(Sheet3!$AA$10:$AA$1471,'FADS v2.0'!C81,1))","v":0},{"$f":"INDEX(Sheet3!$AA$10:$AC$1471,'FADS v2.0'!C81,3)","v":0},null,"","","",""]
[null,{"$f":"IF(D14>8,\"►\",\"\")","v":""},1,{"$f":"IF(H82=\"\",IF(C82=1,\"\",VLOOKUP(F82,Sheet3!$C$11:$D$1471,2,FALSE)),\"\")","v":""},"",{"$f":"IF(C82=\"\",\"\",INDEX(Sheet3!$AA$10:$AA$1471,'FADS v2.0'!C82,1))","v":0},{"$f":"INDEX(Sheet3!$AA$10:$AC$1471,'FADS v2.0'!C82,3)","v":0},null,"","","",""]
[null,{"$f":"IF(D14>9,\"►\",\"\")","v":""},1,{"$f":"IF(H83=\"\",IF(C83=1,\"\",VLOOKUP(F83,Sheet3!$C$11:$D$1471,2,FALSE)),\"\")","v":""},"",{"$f":"IF(C83=\"\",\"\",INDEX(Sheet3!$AA$10:$AA$1471,'FADS v2.0'!C83,1))","v":0},{"$f":"INDEX(Sheet3!$AA$10:$AC$1471,'FADS v2.0'!C83,3)","v":0},null,"","","",""]
[null,{"$f":"IF(D14>10,\"►\",\"\")","v":""},1,{"$f":"IF(H84=\"\",IF(C84=1,\"\",VLOOKUP(F84,Sheet3!$C$11:$D$1471,2,FALSE)),\"\")","v":""},"",{"$f":"IF(C84=\"\",\"\",INDEX(Sheet3!$AA$10:$AA$1471,'FADS v2.0'!C84,1))","v":0},{"$f":"INDEX(Sheet3!$AA$10:$AC$1471,'FADS v2.0'!C84,3)","v":0},null,"","","",""]
[null,{"$f":"IF(D14>11,\"►\",\"\")","v":""},1,{"$f":"IF(H85=\"\",IF(C85=1,\"\",VLOOKUP(F85,Sheet3!$C$11:$D$1471,2,FALSE)),\"\")","v":""},"",{"$f":"IF(C85=\"\",\"\",INDEX(Sheet3!$AA$10:$AA$1471,'FADS v2.0'!C85,1))","v":0},{"$f":"INDEX(Sheet3!$AA$10:$AC$1471,'FADS v2.0'!C85,3)","v":0},null,"","","",""]
[null,{"$f":"IF(D14>12,\"►\",\"\")","v":""},1,{"$f":"IF(H86=\"\",IF(C86=1,\"\",VLOOKUP(F86,Sheet3!$C$11:$D$1471,2,FALSE)),\"\")","v":""},"",{"$f":"IF(C86=\"\",\"\",INDEX(Sheet3!$AA$10:$AA$1471,'FADS v2.0'!C86,1))","v":0},{"$f":"INDEX(Sheet3!$AA$10:$AC$1471,'FADS v2.0'!C86,3)","v":0},null,"","","",""]
[null,{"$f":"IF(D14>13,\"►\",\"\")","v":""},1,{"$f":"IF(H87=\"\",IF(C87=1,\"\",VLOOKUP(F87,Sheet3!$C$11:$D$1471,2,FALSE)),\"\")","v":""},"",{"$f":"IF(C87=\"\",\"\",INDEX(Sheet3!$AA$10:$AA$1471,'FADS v2.0'!C87,1))","v":0},{"$f":"INDEX(Sheet3!$AA$10:$AC$1471,'FADS v2.0'!C87,3)","v":0},null,"","","",""]
[null,{"$f":"IF(D14>14,\"►\",\"\")","v":""},1,{"$f":"IF(H88=\"\",IF(C88=1,\"\",VLOOKUP(F88,Sheet3!$C$11:$D$1471,2,FALSE)),\"\")","v":""},"",{"$f":"IF(C88=\"\",\"\",INDEX(Sheet3!$AA$10:$AA$1471,'FADS v2.0'!C88,1))","v":0},{"$f":"INDEX(Sheet3!$AA$10:$AC$1471,'FADS v2.0'!C88,3)","v":0},null,"","","",""]
[null,{"$f":"IF(D14>15,\"►\",\"\")","v":""},1,{"$f":"IF(H89=\"\",IF(C89=1,\"\",VLOOKUP(F89,Sheet3!$C$11:$D$1471,2,FALSE)),\"\")","v":""},"",{"$f":"IF(C89=\"\",\"\",INDEX(Sheet3!$AA$10:$AA$1471,'FADS v2.0'!C89,1))","v":0},{"$f":"INDEX(Sheet3!$AA$10:$AC$1471,'FADS v2.0'!C89,3)","v":0},null,"","","",""]
[null,{"$f":"IF(D14>16,\"►\",\"\")","v":""},1,{"$f":"IF(H90=\"\",IF(C90=1,\"\",VLOOKUP(F90,Sheet3!$C$11:$D$1471,2,FALSE)),\"\")","v":""},"",{"$f":"IF(C90=\"\",\"\",INDEX(Sheet3!$AA$10:$AA$1471,'FADS v2.0'!C90,1))","v":0},{"$f":"INDEX(Sheet3!$AA$10:$AC$1471,'FADS v2.0'!C90,3)","v":0},null,"","","",""]
[null,{"$f":"IF(D14>17,\"►\",\"\")","v":""},1,{"$f":"IF(H91=\"\",IF(C91=1,\"\",VLOOKUP(F91,Sheet3!$C$11:$D$1471,2,FALSE)),\"\")","v":""},"",{"$f":"IF(C91=\"\",\"\",INDEX(Sheet3!$AA$10:$AA$1471,'FADS v2.0'!C91,1))","v":0},{"$f":"INDEX(Sheet3!$AA$10:$AC$1471,'FADS v2.0'!C91,3)","v":0},null,"","","",""]
[null,{"$f":"IF(D14>18,\"►\",\"\")","v":""},1,{"$f":"IF(H92=\"\",IF(C92=1,\"\",VLOOKUP(F92,Sheet3!$C$11:$D$1471,2,FALSE)),\"\")","v":""},"",{"$f":"IF(C92=\"\",\"\",INDEX(Sheet3!$AA$10:$AA$1471,'FADS v2.0'!C92,1))","v":0},{"$f":"INDEX(Sheet3!$AA$10:$AC$1471,'FADS v2.0'!C92,3)","v":0},null,"","","",""]
[null,{"$f":"IF(D14>19,\"►\",\"\")","v":""},1,{"$f":"IF(H93=\"\",IF(C93=1,\"\",VLOOKUP(F93,Sheet3!$C$11:$D$1471,2,FALSE)),\"\")","v":""},"",{"$f":"IF(C93=\"\",\"\",INDEX(Sheet3!$AA$10:$AA$1471,'FADS v2.0'!C93,1))","v":0},{"$f":"INDEX(Sheet3!$AA$10:$AC$1471,'FADS v2.0'!C93,3)","v":0},null,"","","",""]
[null,{"$f":"IF(D14>20,\"►\",\"\")","v":""},1,{"$f":"IF(H94=\"\",IF(C94=1,\"\",VLOOKUP(F94,Sheet3!$C$11:$D$1471,2,FALSE)),\"\")","v":""},"",{"$f":"IF(C94=\"\",\"\",INDEX(Sheet3!$AA$10:$AA$1471,'FADS v2.0'!C94,1))","v":0},{"$f":"INDEX(Sheet3!$AA$10:$AC$1471,'FADS v2.0'!C94,3)","v":0},null,"","","",""]
[null,{"$f":"IF(D14>21,\"►\",\"\")","v":""},1,{"$f":"IF(H95=\"\",IF(C95=1,\"\",VLOOKUP(F95,Sheet3!$C$11:$D$1471,2,FALSE)),\"\")","v":""},"",{"$f":"IF(C95=\"\",\"\",INDEX(Sheet3!$AA$10:$AA$1471,'FADS v2.0'!C95,1))","v":0},{"$f":"INDEX(Sheet3!$AA$10:$AC$1471,'FADS v2.0'!C95,3)","v":0},null,"","","",""]
[null,{"$f":"IF(D14>22,\"►\",\"\")","v":""},1,{"$f":"IF(H96=\"\",IF(C96=1,\"\",VLOOKUP(F96,Sheet3!$C$11:$D$1471,2,FALSE)),\"\")","v":""},"",{"$f":"IF(C96=\"\",\"\",INDEX(Sheet3!$AA$10:$AA$1471,'FADS v2.0'!C96,1))","v":0},{"$f":"INDEX(Sheet3!$AA$10:$AC$1471,'FADS v2.0'!C96,3)","v":0},null,"","","",""]
[null,{"$f":"IF(D14>23,\"►\",\"\")","v":""},1,{"$f":"IF(H97=\"\",IF(C97=1,\"\",VLOOKUP(F97,Sheet3!$C$11:$D$1471,2,FALSE)),\"\")","v":""},"",{"$f":"IF(C97=\"\",\"\",INDEX(Sheet3!$AA$10:$AA$1471,'FADS v2.0'!C97,1))","v":0},{"$f":"INDEX(Sheet3!$AA$10:$AC$1471,'FADS v2.0'!C97,3)","v":0},null,"","","",""]
[null,{"$f":"IF(D14>24,\"►\",\"\")","v":""},1,{"$f":"IF(H98=\"\",IF(C98=1,\"\",VLOOKUP(F98,Sheet3!$C$11:$D$1471,2,FALSE)),\"\")","v":""},"",{"$f":"IF(C98=\"\",\"\",INDEX(Sheet3!$AA$10:$AA$1471,'FADS v2.0'!C98,1))","v":0},{"$f":"INDEX(Sheet3!$AA$10:$AC$1471,'FADS v2.0'!C98,3)","v":0},null,"","","",""]
[null,{"$f":"IF(D14>25,\"►\",\"\")","v":""},1,{"$f":"IF(H99=\"\",IF(C99=1,\"\",VLOOKUP(F99,Sheet3!$C$11:$D$1471,2,FALSE)),\"\")","v":""},"",{"$f":"IF(C99=\"\",\"\",INDEX(Sheet3!$AA$10:$AA$1471,'FADS v2.0'!C99,1))","v":0},{"$f":"INDEX(Sheet3!$AA$10:$AC$1471,'FADS v2.0'!C99,3)","v":0},null,"","","",""]
[null,{"$f":"IF(D14>26,\"►\",\"\")","v":""},1,{"$f":"IF(H100=\"\",IF(C100=1,\"\",VLOOKUP(F100,Sheet3!$C$11:$D$1471,2,FALSE)),\"\")","v":""},"",{"$f":"IF(C100=\"\",\"\",INDEX(Sheet3!$AA$10:$AA$1471,'FADS v2.0'!C100,1))","v":0},{"$f":"INDEX(Sheet3!$AA$10:$AC$1471,'FADS v2.0'!C100,3)","v":0},null,"","","",""]
[null,{"$f":"IF(D14>27,\"►\",\"\")","v":""},1,{"$f":"IF(H101=\"\",IF(C101=1,\"\",VLOOKUP(F101,Sheet3!$C$11:$D$1471,2,FALSE)),\"\")","v":""},"",{"$f":"IF(C101=\"\",\"\",INDEX(Sheet3!$AA$10:$AA$1471,'FADS v2.0'!C101,1))","v":0},{"$f":"INDEX(Sheet3!$AA$10:$AC$1471,'FADS v2.0'!C101,3)","v":0},null,"","","",""]
[null,{"$f":"IF(D14>28,\"►\",\"\")","v":""},1,{"$f":"IF(H102=\"\",IF(C102=1,\"\",VLOOKUP(F102,Sheet3!$C$11:$D$1471,2,FALSE)),\"\")","v":""},"",{"$f":"IF(C102=\"\",\"\",INDEX(Sheet3!$AA$10:$AA$1471,'FADS v2.0'!C102,1))","v":0},{"$f":"INDEX(Sheet3!$AA$10:$AC$1471,'FADS v2.0'!C102,3)","v":0},null,"","","",""]
[null,{"$f":"IF(D14>29,\"►\",\"\")","v":""},1,{"$f":"IF(H103=\"\",IF(C103=1,\"\",VLOOKUP(F103,Sheet3!$C$11:$D$1471,2,FALSE)),\"\")","v":""},"",{"$f":"IF(C103=\"\",\"\",INDEX(Sheet3!$AA$10:$AA$1471,'FADS v2.0'!C103,1))","v":0},{"$f":"INDEX(Sheet3!$AA$10:$AC$1471,'FADS v2.0'!C103,3)","v":0},null,"","","",""]
[null,{"$f":"IF(D14>30,\"►\",\"\")","v":""},1,{"$f":"IF(H104=\"\",IF(C104=1,\"\",VLOOKUP(F104,Sheet3!$C$11:$D$1471,2,FALSE)),\"\")","v":""},"",{"$f":"IF(C104=\"\",\"\",INDEX(Sheet3!$AA$10:$AA$1471,'FADS v2.0'!C104,1))","v":0},{"$f":"INDEX(Sheet3!$AA$10:$AC$1471,'FADS v2.0'!C104,3)","v":0},null,"","","",""]
[null,{"$f":"IF(D14>31,\"►\",\"\")","v":""},1,{"$f":"IF(H105=\"\",IF(C105=1,\"\",VLOOKUP(F105,Sheet3!$C$11:$D$1471,2,FALSE)),\"\")","v":""},"",{"$f":"IF(C105=\"\",\"\",INDEX(Sheet3!$AA$10:$AA$1471,'FADS v2.0'!C105,1))","v":0},{"$f":"INDEX(Sheet3!$AA$10:$AC$1471,'FADS v2.0'!C105,3)","v":0},null,"","","",""]
[null,{"$f":"IF(D14>32,\"►\",\"\")","v":""},1,{"$f":"IF(H106=\"\",IF(C106=1,\"\",VLOOKUP(F106,Sheet3!$C$11:$D$1471,2,FALSE)),\"\")","v":""},"",{"$f":"IF(C106=\"\",\"\",INDEX(Sheet3!$AA$10:$AA$1471,'FADS v2.0'!C106,1))","v":0},{"$f":"INDEX(Sheet3!$AA$10:$AC$1471,'FADS v2.0'!C106,3)","v":0},null,{"$f":"IF(H106=\"\",IF(E106=\"\",\"\",IF(D106=\"\",\"\",E106/$E$32)),IF(E106=\"\",\"\",IF(H106=\"\",\"\",E106/$E$32)))","v":""},{"$f":"IF(N106=\"\",IF(M106=\"\",\"\",M106/$I$17),N106/$I$17)","v":""},{"$f":"IF(M106=\"\",IF(N106=\"\",IF(H106=\"\",IF(D106=\"\",\"\",IF($D$27=\"\",\"\",$D$27*I106)),$D$27*I106),\"\"),\"\")","v":""},{"$f":"IF(D106=\"\",\"\",$I$17*I106)","v":""}]
[null,{"$f":"IF(D14>33,\"►\",\"\")","v":""},1,{"$f":"IF(H107=\"\",IF(C107=1,\"\",VLOOKUP(F107,Sheet3!$C$11:$D$1471,2,FALSE)),\"\")","v":""},"",{"$f":"IF(C107=\"\",\"\",INDEX(Sheet3!$AA$10:$AA$1471,'FADS v2.0'!C107,1))","v":0},{"$f":"INDEX(Sheet3!$AA$10:$AC$1471,'FADS v2.0'!C107,3)","v":0},null,"","","",""]
[null,{"$f":"IF(D14>34,\"►\",\"\")","v":""},1,{"$f":"IF(H108=\"\",IF(C108=1,\"\",VLOOKUP(F108,Sheet3!$C$11:$D$1471,2,FALSE)),\"\")","v":""},{"$f":"IF(N108=\"\",IF(M108=\"\",IF(H108=\"\",D108,H108),\"\"),\"\")","v":""},{"$f":"IF(C108=\"\",\"\",INDEX(Sheet3!$AA$10:$AA$1471,'FADS v2.0'!C108,1))","v":0},{"$f":"INDEX(Sheet3!$AA$10:$AC$1471,'FADS v2.0'!C108,3)","v":0},null,"","","",""]
[null,{"$f":"IF(D14>35,\"►\",\"\")","v":""},1,{"$f":"IF(H109=\"\",IF(C109=1,\"\",VLOOKUP(F109,Sheet3!$C$11:$D$1471,2,FALSE)),\"\")","v":""},"",{"$f":"IF(C109=\"\",\"\",INDEX(Sheet3!$AA$10:$AA$1471,'FADS v2.0'!C109,1))","v":0},{"$f":"INDEX(Sheet3!$AA$10:$AC$1471,'FADS v2.0'!C109,3)","v":0},null,"","","",""]
[null,{"$f":"IF(D14>36,\"►\",\"\")","v":""},1,{"$f":"IF(H110=\"\",IF(C110=1,\"\",VLOOKUP(F110,Sheet3!$C$11:$D$1471,2,FALSE)),\"\")","v":""},"",{"$f":"IF(C110=\"\",\"\",INDEX(Sheet3!$AA$10:$AA$1471,'FADS v2.0'!C110,1))","v":0},{"$f":"INDEX(Sheet3!$AA$10:$AC$1471,'FADS v2.0'!C110,3)","v":0},null,"","","",""]
[null,{"$f":"IF(D14>37,\"►\",\"\")","v":""},1,{"$f":"IF(H111=\"\",IF(C111=1,\"\",VLOOKUP(F111,Sheet3!$C$11:$D$1471,2,FALSE)),\"\")","v":""},"",{"$f":"IF(C111=\"\",\"\",INDEX(Sheet3!$AA$10:$AA$1471,'FADS v2.0'!C111,1))","v":0},{"$f":"INDEX(Sheet3!$AA$10:$AC$1471,'FADS v2.0'!C111,3)","v":0},null,"","","",""]
[null,{"$f":"IF(D14>38,\"►\",\"\")","v":""},1,{"$f":"IF(H112=\"\",IF(C112=1,\"\",VLOOKUP(F112,Sheet3!$C$11:$D$1471,2,FALSE)),\"\")","v":""},"",{"$f":"IF(C112=\"\",\"\",INDEX(Sheet3!$AA$10:$AA$1471,'FADS v2.0'!C112,1))","v":0},{"$f":"INDEX(Sheet3!$AA$10:$AC$1471,'FADS v2.0'!C112,3)","v":0},null,"","","",""]
[null,{"$f":"IF(D14>39,\"►\",\"\")","v":""},1,{"$f":"IF(H113=\"\",IF(C113=1,\"\",VLOOKUP(F113,Sheet3!$C$11:$D$1471,2,FALSE)),\"\")","v":""},"",{"$f":"IF(C113=\"\",\"\",INDEX(Sheet3!$AA$10:$AA$1471,'FADS v2.0'!C113,1))","v":0},{"$f":"INDEX(Sheet3!$AA$10:$AC$1471,'FADS v2.0'!C113,3)","v":0},null,"","","",""]
[null,{"$f":"IF(D14>40,\"►\",\"\")","v":""},1,{"$f":"IF(H114=\"\",IF(C114=1,\"\",VLOOKUP(F114,Sheet3!$C$11:$D$1471,2,FALSE)),\"\")","v":""},"",{"$f":"IF(C114=\"\",\"\",INDEX(Sheet3!$AA$10:$AA$1471,'FADS v2.0'!C114,1))","v":0},{"$f":"INDEX(Sheet3!$AA$10:$AC$1471,'FADS v2.0'!C114,3)","v":0},null,"","","",""]
[null,{"$f":"IF(D14>41,\"►\",\"\")","v":""},1,{"$f":"IF(H115=\"\",IF(C115=1,\"\",VLOOKUP(F115,Sheet3!$C$11:$D$1471,2,FALSE)),\"\")","v":""},"",{"$f":"IF(C115=\"\",\"\",INDEX(Sheet3!$AA$10:$AA$1471,'FADS v2.0'!C115,1))","v":0},{"$f":"INDEX(Sheet3!$AA$10:$AC$1471,'FADS v2.0'!C115,3)","v":0},null,"","","",""]
[null,{"$f":"IF(D14>42,\"►\",\"\")","v":""},1,{"$f":"IF(H116=\"\",IF(C116=1,\"\",VLOOKUP(F116,Sheet3!$C$11:$D$1471,2,FALSE)),\"\")","v":""},"",{"$f":"IF(C116=\"\",\"\",INDEX(Sheet3!$AA$10:$AA$1471,'FADS v2.0'!C116,1))","v":0},{"$f":"INDEX(Sheet3!$AA$10:$AC$1471,'FADS v2.0'!C116,3)","v":0},null,"","","",""]
[null,{"$f":"IF(D14>43,\"►\",\"\")","v":""},1,{"$f":"IF(H117=\"\",IF(C117=1,\"\",VLOOKUP(F117,Sheet3!$C$11:$D$1471,2,FALSE)),\"\")","v":""},"",{"$f":"IF(C117=\"\",\"\",INDEX(Sheet3!$AA$10:$AA$1471,'FADS v2.0'!C117,1))","v":0},{"$f":"INDEX(Sheet3!$AA$10:$AC$1471,'FADS v2.0'!C117,3)","v":0},null,"","","",""]
[null,{"$f":"IF(D14>44,\"►\",\"\")","v":""},1,{"$f":"IF(H118=\"\",IF(C118=1,\"\",VLOOKUP(F118,Sheet3!$C$11:$D$1471,2,FALSE)),\"\")","v":""},"",{"$f":"IF(C118=\"\",\"\",INDEX(Sheet3!$AA$10:$AA$1471,'FADS v2.0'!C118,1))","v":0},{"$f":"INDEX(Sheet3!$AA$10:$AC$1471,'FADS v2.0'!C118,3)","v":0},null,"","","",""]
[null,{"$f":"IF(D14>45,\"►\",\"\")","v":""},1,{"$f":"IF(H119=\"\",IF(C119=1,\"\",VLOOKUP(F119,Sheet3!$C$11:$D$1471,2,FALSE)),\"\")","v":""},"",{"$f":"IF(C119=\"\",\"\",INDEX(Sheet3!$AA$10:$AA$1471,'FADS v2.0'!C119,1))","v":0},{"$f":"INDEX(Sheet3!$AA$10:$AC$1471,'FADS v2.0'!C119,3)","v":0},null,"","","",""]
[null,{"$f":"IF(D14>46,\"►\",\"\")","v":""},1,{"$f":"IF(H120=\"\",IF(C120=1,\"\",VLOOKUP(F120,Sheet3!$C$11:$D$1471,2,FALSE)),\"\")","v":""},"",{"$f":"IF(C120=\"\",\"\",INDEX(Sheet3!$AA$10:$AA$1471,'FADS v2.0'!C120,1))","v":0},{"$f":"INDEX(Sheet3!$AA$10:$AC$1471,'FADS v2.0'!C120,3)","v":0},null,"","","",""]
[null,{"$f":"IF(D14>47,\"►\",\"\")","v":""},1,{"$f":"IF(H121=\"\",IF(C121=1,\"\",VLOOKUP(F121,Sheet3!$C$11:$D$1471,2,FALSE)),\"\")","v":""},"",{"$f":"IF(C121=\"\",\"\",INDEX(Sheet3!$AA$10:$AA$1471,'FADS v2.0'!C121,1))","v":0},{"$f":"INDEX(Sheet3!$AA$10:$AC$1471,'FADS v2.0'!C121,3)","v":0},null,"","","",""]
[null,{"$f":"IF(D14>48,\"►\",\"\")","v":""},1,{"$f":"IF(H122=\"\",IF(C122=1,\"\",VLOOKUP(F122,Sheet3!$C$11:$D$1471,2,FALSE)),\"\")","v":""},"",{"$f":"IF(C122=\"\",\"\",INDEX(Sheet3!$AA$10:$AA$1471,'FADS v2.0'!C122,1))","v":0},{"$f":"INDEX(Sheet3!$AA$10:$AC$1471,'FADS v2.0'!C122,3)","v":0},null,"","","",""]
[null,{"$f":"IF(D14>49,\"►\",\"\")","v":""},1,{"$f":"IF(H123=\"\",IF(C123=1,\"\",VLOOKUP(F123,Sheet3!$C$11:$D$1471,2,FALSE)),\"\")","v":""},"",{"$f":"IF(C123=\"\",\"\",INDEX(Sheet3!$AA$10:$AA$1471,'FADS v2.0'!C123,1))","v":0},{"$f":"INDEX(Sheet3!$AA$10:$AC$1471,'FADS v2.0'!C123,3)","v":0},null,"","","",""]
[null,{"$f":"IF(D14>50,\"►\",\"\")","v":""},1,{"$f":"IF(H124=\"\",IF(C124=1,\"\",VLOOKUP(F124,Sheet3!$C$11:$D$1471,2,FALSE)),\"\")","v":""},"",{"$f":"IF(C124=\"\",\"\",INDEX(Sheet3!$AA$10:$AA$1471,'FADS v2.0'!C124,1))","v":0},{"$f":"INDEX(Sheet3!$AA$10:$AC$1471,'FADS v2.0'!C124,3)","v":0},null,"","","",""]
[null,{"$f":"IF(D14>51,\"►\",\"\")","v":""},1,{"$f":"IF(H125=\"\",IF(C125=1,\"\",VLOOKUP(F125,Sheet3!$C$11:$D$1471,2,FALSE)),\"\")","v":""},"",{"$f":"IF(C125=\"\",\"\",INDEX(Sheet3!$AA$10:$AA$1471,'FADS v2.0'!C125,1))","v":0},{"$f":"INDEX(Sheet3!$AA$10:$AC$1471,'FADS v2.0'!C125,3)","v":0},null,"","","",""]
[null,{"$f":"IF(D14>52,\"►\",\"\")","v":""},1,{"$f":"IF(H126=\"\",IF(C126=1,\"\",VLOOKUP(F126,Sheet3!$C$11:$D$1471,2,FALSE)),\"\")","v":""},"",{"$f":"IF(C126=\"\",\"\",INDEX(Sheet3!$AA$10:$AA$1471,'FADS v2.0'!C126,1))","v":0},{"$f":"INDEX(Sheet3!$AA$10:$AC$1471,'FADS v2.0'!C126,3)","v":0},null,"","","",""]
[null,{"$f":"IF(D14>53,\"►\",\"\")","v":""},1,{"$f":"IF(H127=\"\",IF(C127=1,\"\",VLOOKUP(F127,Sheet3!$C$11:$D$1471,2,FALSE)),\"\")","v":""},"",{"$f":"IF(C127=\"\",\"\",INDEX(Sheet3!$AA$10:$AA$1471,'FADS v2.0'!C127,1))","v":0},{"$f":"INDEX(Sheet3!$AA$10:$AC$1471,'FADS v2.0'!C127,3)","v":0},null,"","","",""]
[null,{"$f":"IF(D14>54,\"►\",\"\")","v":""},1,{"$f":"IF(H128=\"\",IF(C128=1,\"\",VLOOKUP(F128,Sheet3!$C$11:$D$1471,2,FALSE)),\"\")","v":""},"",{"$f":"IF(C128=\"\",\"\",INDEX(Sheet3!$AA$10:$AA$1471,'FADS v2.0'!C128,1))","v":0},{"$f":"INDEX(Sheet3!$AA$10:$AC$1471,'FADS v2.0'!C128,3)","v":0},null,"","","",""]
[null,{"$f":"IF(D14>55,\"►\",\"\")","v":""},1,{"$f":"IF(H129=\"\",IF(C129=1,\"\",VLOOKUP(F129,Sheet3!$C$11:$D$1471,2,FALSE)),\"\")","v":""},"",{"$f":"IF(C129=\"\",\"\",INDEX(Sheet3!$AA$10:$AA$1471,'FADS v2.0'!C129,1))","v":0},{"$f":"INDEX(Sheet3!$AA$10:$AC$1471,'FADS v2.0'!C129,3)","v":0},null,"","","",""]
[null,{"$f":"IF(D14>56,\"►\",\"\")","v":""},1,{"$f":"IF(H130=\"\",IF(C130=1,\"\",VLOOKUP(F130,Sheet3!$C$11:$D$1471,2,FALSE)),\"\")","v":""},"",{"$f":"IF(C130=\"\",\"\",INDEX(Sheet3!$AA$10:$AA$1471,'FADS v2.0'!C130,1))","v":0},{"$f":"INDEX(Sheet3!$AA$10:$AC$1471,'FADS v2.0'!C130,3)","v":0},null,"","","",""]
[null,{"$f":"IF(D14>57,\"►\",\"\")","v":""},1,{"$f":"IF(H131=\"\",IF(C131=1,\"\",VLOOKUP(F131,Sheet3!$C$11:$D$1471,2,FALSE)),\"\")","v":""},"",{"$f":"IF(C131=\"\",\"\",INDEX(Sheet3!$AA$10:$AA$1471,'FADS v2.0'!C131,1))","v":0},{"$f":"INDEX(Sheet3!$AA$10:$AC$1471,'FADS v2.0'!C131,3)","v":0},null,"","","",""]
[null,{"$f":"IF(D14>58,\"►\",\"\")","v":""},1,{"$f":"IF(H132=\"\",IF(C132=1,\"\",VLOOKUP(F132,Sheet3!$C$11:$D$1471,2,FALSE)),\"\")","v":""},"",{"$f":"IF(C132=\"\",\"\",INDEX(Sheet3!$AA$10:$AA$1471,'FADS v2.0'!C132,1))","v":0},{"$f":"INDEX(Sheet3!$AA$10:$AC$1471,'FADS v2.0'!C132,3)","v":0},null,"","","",""]
[null,{"$f":"IF(D14>59,\"►\",\"\")","v":""},1,{"$f":"IF(H133=\"\",IF(C133=1,\"\",VLOOKUP(F133,Sheet3!$C$11:$D$1471,2,FALSE)),\"\")","v":""},"",{"$f":"IF(C133=\"\",\"\",INDEX(Sheet3!$AA$10:$AA$1471,'FADS v2.0'!C133,1))","v":0},{"$f":"INDEX(Sheet3!$AA$10:$AC$1471,'FADS v2.0'!C133,3)","v":0},null,"","","",""]
[null,{"$f":"IF(D14>60,\"►\",\"\")","v":""},1,{"$f":"IF(H134=\"\",IF(C134=1,\"\",VLOOKUP(F134,Sheet3!$C$11:$D$1471,2,FALSE)),\"\")","v":""},"",{"$f":"IF(C134=\"\",\"\",INDEX(Sheet3!$AA$10:$AA$1471,'FADS v2.0'!C134,1))","v":0},{"$f":"INDEX(Sheet3!$AA$10:$AC$1471,'FADS v2.0'!C134,3)","v":0},null,"","","",""]
[null,{"$f":"IF(D14>61,\"►\",\"\")","v":""},1,{"$f":"IF(H135=\"\",IF(C135=1,\"\",VLOOKUP(F135,Sheet3!$C$11:$D$1471,2,FALSE)),\"\")","v":""},"",{"$f":"IF(C135=\"\",\"\",INDEX(Sheet3!$AA$10:$AA$1471,'FADS v2.0'!C135,1))","v":0},{"$f":"INDEX(Sheet3!$AA$10:$AC$1471,'FADS v2.0'!C135,3)","v":0},null,"","","",""]
[null,{"$f":"IF(D14>62,\"►\",\"\")","v":""},1,{"$f":"IF(H136=\"\",IF(C136=1,\"\",VLOOKUP(F136,Sheet3!$C$11:$D$1471,2,FALSE)),\"\")","v":""},"",{"$f":"IF(C136=\"\",\"\",INDEX(Sheet3!$AA$10:$AA$1471,'FADS v2.0'!C136,1))","v":0},{"$f":"INDEX(Sheet3!$AA$10:$AC$1471,'FADS v2.0'!C136,3)","v":0},null,"","","",""]
[null,{"$f":"IF(D14>63,\"►\",\"\")","v":""},1,{"$f":"IF(H137=\"\",IF(C137=1,\"\",VLOOKUP(F137,Sheet3!$C$11:$D$1471,2,FALSE)),\"\")","v":""},"",{"$f":"IF(C137=\"\",\"\",INDEX(Sheet3!$AA$10:$AA$1471,'FADS v2.0'!C137,1))","v":0},{"$f":"INDEX(Sheet3!$AA$10:$AC$1471,'FADS v2.0'!C137,3)","v":0},null,"","","",""]
[null,{"$f":"IF(D14>64,\"►\",\"\")","v":""},1,{"$f":"IF(H138=\"\",IF(C138=1,\"\",VLOOKUP(F138,Sheet3!$C$11:$D$1471,2,FALSE)),\"\")","v":""},"",{"$f":"IF(C138=\"\",\"\",INDEX(Sheet3!$AA$10:$AA$1471,'FADS v2.0'!C138,1))","v":0},{"$f":"INDEX(Sheet3!$AA$10:$AC$1471,'FADS v2.0'!C138,3)","v":0},null,{"$f":"IF(H138=\"\",IF(E138=\"\",\"\",IF(D138=\"\",\"\",E138/$E$32)),IF(E138=\"\",\"\",IF(H138=\"\",\"\",E138/$E$32)))","v":""},{"$f":"IF(N138=\"\",IF(M138=\"\",\"\",M138/$I$17),N138/$I$17)","v":""},{"$f":"IF(M138=\"\",IF(N138=\"\",IF(H138=\"\",IF(D138=\"\",\"\",IF($D$27=\"\",\"\",$D$27*I138)),$D$27*I138),\"\"),\"\")","v":""},{"$f":"IF(D138=\"\",\"\",$I$17*I138)","v":""}]
[null,{"$f":"IF(D14>65,\"►\",\"\")","v":""},1,{"$f":"IF(H139=\"\",IF(C139=1,\"\",VLOOKUP(F139,Sheet3!$C$11:$D$1471,2,FALSE)),\"\")","v":""},"",{"$f":"IF(C139=\"\",\"\",INDEX(Sheet3!$AA$10:$AA$1471,'FADS v2.0'!C139,1))","v":0},{"$f":"INDEX(Sheet3!$AA$10:$AC$1471,'FADS v2.0'!C139,3)","v":0},null,"","","",""]
[null,{"$f":"IF(D14>66,\"►\",\"\")","v":""},1,{"$f":"IF(H140=\"\",IF(C140=1,\"\",VLOOKUP(F140,Sheet3!$C$11:$D$1471,2,FALSE)),\"\")","v":""},"",{"$f":"IF(C140=\"\",\"\",INDEX(Sheet3!$AA$10:$AA$1471,'FADS v2.0'!C140,1))","v":0},{"$f":"INDEX(Sheet3!$AA$10:$AC$1471,'FADS v2.0'!C140,3)","v":0},null,"","","",""]
[null,{"$f":"IF(D14>67,\"►\",\"\")","v":""},1,{"$f":"IF(H141=\"\",IF(C141=1,\"\",VLOOKUP(F141,Sheet3!$C$11:$D$1471,2,FALSE)),\"\")","v":""},"",{"$f":"IF(C141=\"\",\"\",INDEX(Sheet3!$AA$10:$AA$1471,'FADS v2.0'!C141,1))","v":0},{"$f":"INDEX(Sheet3!$AA$10:$AC$1471,'FADS v2.0'!C141,3)","v":0},null,"","","",""]
[null,{"$f":"IF(D14>68,\"►\",\"\")","v":""},1,{"$f":"IF(H142=\"\",IF(C142=1,\"\",VLOOKUP(F142,Sheet3!$C$11:$D$1471,2,FALSE)),\"\")","v":""},"",{"$f":"IF(C142=\"\",\"\",INDEX(Sheet3!$AA$10:$AA$1471,'FADS v2.0'!C142,1))","v":0},{"$f":"INDEX(Sheet3!$AA$10:$AC$1471,'FADS v2.0'!C142,3)","v":0},null,"","","",""]
[null,{"$f":"IF(D14>69,\"►\",\"\")","v":""},1,{"$f":"IF(H143=\"\",IF(C143=1,\"\",VLOOKUP(F143,Sheet3!$C$11:$D$1471,2,FALSE)),\"\")","v":""},"",{"$f":"IF(C143=\"\",\"\",INDEX(Sheet3!$AA$10:$AA$1471,'FADS v2.0'!C143,1))","v":0},{"$f":"INDEX(Sheet3!$AA$10:$AC$1471,'FADS v2.0'!C143,3)","v":0},null,"","","",""]
[null,{"$f":"IF(D14>70,\"►\",\"\")","v":""},1,{"$f":"IF(H144=\"\",IF(C144=1,\"\",VLOOKUP(F144,Sheet3!$C$11:$D$1471,2,FALSE)),\"\")","v":""},"",{"$f":"IF(C144=\"\",\"\",INDEX(Sheet3!$AA$10:$AA$1471,'FADS v2.0'!C144,1))","v":0},{"$f":"INDEX(Sheet3!$AA$10:$AC$1471,'FADS v2.0'!C144,3)","v":0},null,"","","",""]
[]
[]
[]
[]
[]
[]
[]
[]
[]
[]
[]
[]
[]
[]
[]
[]
[]
[]
[]
[]
[]
[]
[]
[]
[]
[]
[]
[]
[]
[]
[]
[]
[]
[]
[]
[]
[]
[]
[]
[]
[]
[]
[]
[]
[]
[]
[]
[]
[]
[]
[]
[]
[]
[]
[]
[]
[]
[]
[]
[]
[]
[]
[]
[]
[]
[]
[]
[]
[]
[]
[]
[]
[]
[]
[]
[]
[]
[]
[]
[]
[]
[]
[]
[]
[]
[]
[]
[]
[]
[]
[]
[]
[]
[]
[]
[]
[]
[]
[]
[]
[]
[]
[]
[]
[]
[]
[]
[]
[]
[]
[]
[]
[]
[]
[]
[]
[]
[]
[]
[]
[]
[]
[]
[]
[]
[]
[]
[]
[]
[]
[]
[]
[]
[]
[]
[]
[]
[]
[]
[]
[]
[]
[]
[]
[]
[]
[]
[]
[]
[]
[]
[]
[]
[]
[]
[]
[]
[]
[]
[]
[]
[]
[]
[]
[]
[]
[]
[]
[]
[]
[]
[]
[]
[]
[]
[]
[]
[]
[]
[]
[]
[]
[]
[]
[]
[]
[]
[]
[]
[]
[]
[]
[]
[]
[]
[]
[]
[]
[]
[]
[]
[]
[]
[]
[]
[]
[]
[]
[]
[]
[]
[]
[]
[]
[]
[]
[]
[]
[]
[]
[]
[]
[]
[]
[]
[]
[]
[]
[]
[]
[]
[]
[]
[]
[]
[]
[]
[]
[]
[]
[]
[]
[]
[]
[]
[]
[]
[]
[]
[]
[]
[]
[]
[]
[]
[]
[]
[]
[]
[]
[]
[]
[]
[]
[]
[]
[]
[]
[]
[]
[]
[]
[]
[]
[]
[]
[]
[]
[]
[]
[]
[]
[]
[]
[]
[]
[]
[]
[]
[]
[]
[]
[]
[]
[]
[]
[]
[]
[]
[]
[]
[]
[]
[]
[]
[]
[]
[]
[]
[]
[]
[]
[]
[]
[]
[]
[]
[]
[]
[]
[]
[]
[]
[]
[]
[]
[]
[]
[]
[]
[]
[]
[]
[]
[]
[]
[]
[]
[]
[]
[]
[]
[]
[]
[]
[]
[]
[]
[]
[]
[]
[]
[]
[]
[]
[]
[]
[]
[]
[]
[]
[]
[]
[]
[]
[]
[]
[]
[]
[]
[]
[]
[]
[]
[]
[]
[]
[]
[]
[null,null,null,null,null,null,null,null,{"$f":"IF(D524=\"\",\"\",D524/#REF!)","v":""},null,{"$f":"IF(D524=\"\",\"\",$D$23*I524)","v":""}]
[null,null,null,null,null,null,null,null,{"$f":"IF(D525=\"\",\"\",D525/#REF!)","v":""},null,{"$f":"IF(D525=\"\",\"\",$D$23*I525)","v":""}]
[null,null,null,null,null,null,null,null,{"$f":"IF(D526=\"\",\"\",D526/#REF!)","v":""},null,{"$f":"IF(D526=\"\",\"\",$D$23*I526)","v":""}]

{"sheet":"Sheet2","index":1,"n_rows":3,"n_cols":1,"rows_kept":3,"cut":false,"hidden":true,"merged":[]}
["Aggressive"]
["Balanced"]
["Value-Depth"]

{"sheet":"Sheet3","index":2,"n_rows":1471,"n_cols":53,"rows_kept":1471,"cut":false,"hidden":true,"merged":[[1456,0,1456,1],[1457,0,1457,1],[1458,0,1458,1],[1459,0,1459,1],[6,52,6,53],[17,52,17,53],[37,52,37,53],[51,52,51,53],[53,52,53,53],[59,52,59,53],[76,52,76,53],[90,52,90,53],[93,52,93,53],[97,52,97,53],[100,52,100,53],[119,52,119,53],[127,52,127,53],[292,52,292,56],[293,52,293,56],[287,52,287,56],[288,52,288,56],[289,52,289,56],[290,52,290,56],[291,52,291,56],[282,52,282,56],[283,52,283,56],[284,52,284,56],[285,52,285,56],[286,52,286,56],[277,52,277,56],[278,52,278,56],[279,52,279,56],[280,52,280,56],[281,52,281,56],[272,52,272,56],[273,52,273,56],[274,52,274,56],[275,52,275,56],[276,52,276,56],[267,52,267,56],[268,52,268,56],[269,52,269,56],[270,52,270,56],[271,52,271,56],[262,52,262,56],[263,52,263,56],[264,52,264,56],[265,52,265,56],[266,52,266,56],[257,52,257,56],[258,52,258,56],[259,52,259,56],[260,52,260,56],[261,52,261,56],[252,52,252,56],[253,52,253,56],[254,52,254,56],[255,52,255,56],[256,52,256,56],[247,52,247,56],[248,52,248,56],[249,52,249,56],[250,52,250,56],[251,52,251,56],[242,52,242,56],[243,52,243,56],[244,52,244,56],[245,52,245,56],[246,52,246,56],[237,52,237,56],[238,52,238,56],[239,52,239,56],[240,52,240,56],[241,52,241,56],[232,52,232,56],[233,52,233,56],[234,52,234,56],[235,52,235,56],[236,52,236,56],[220,52,220,56],[221,52,221,56],[229,52,229,56],[230,52,230,56],[231,52,231,56],[215,52,215,56],[216,52,216,56],[217,52,217,56],[218,52,218,56],[219,52,219,56],[210,52,210,56],[211,52,211,56],[212,52,212,56],[213,52,213,56],[214,52,214,56],[205,52,205,56],[206,52,206,56],[207,52,207,56],[208,52,208,56],[209,52,209,56],[200,52,200,56],[201,52,201,56],[202,52,202,56],[203,52,203,56],[204,52,204,56],[195,52,195,56],[196,52,196,56],[197,52,197,56],[198,52,198,56],[199,52,199,56],[190,52,190,56],[191,52,191,56],[192,52,192,56],[193,52,193,56],[194,52,194,56],[185,52,185,56],[186,52,186,56],[187,52,187,56],[188,52,188,56],[189,52,189,56],[180,52,180,56],[181,52,181,56],[182,52,182,56],[183,52,183,56],[184,52,184,56],[175,52,175,56],[176,52,176,56],[177,52,177,56],[178,52,178,56],[179,52,179,56],[170,52,170,56],[171,52,171,56],[172,52,172,56],[173,52,173,56],[174,52,174,56],[165,52,165,56],[166,52,166,56],[167,52,167,56],[168,52,168,56],[169,52,169,56],[148,52,148,56],[149,52,149,56],[160,52,160,56],[161,52,161,56],[162,52,162,56],[163,52,163,56],[164,52,164,56],[155,52,155,56],[156,52,156,56],[157,52,157,56],[158,52,158,56],[159,52,159,56],[48,52,48,53],[74,52,74,53],[150,52,150,56],[151,52,151,56],[152,52,152,56],[153,52,153,56],[154,52,154,56],[145,52,145,56],[146,52,146,56],[147,52,147,56],[2,52,4,52],[128,52,128,53],[133,52,133,53],[141,52,141,56],[142,52,142,56],[143,52,143,56],[144,52,144,56],[4,0,6,0],[8,5,8,21]]}
[null,null,null,null,null,null,null,null,null,null,null,null,null,null,null,null,null,null,null,null,null,null,null,null,null,{"$f":"'FADS v2.0'!B7-1","v":-1},{"$f":"AA2","v":"http://football.myfantasyleague.com//top?L=&SEARCHTYPE=BASIC&COUNT=1500&YEAR=-1&START_WEEK=1&END_WEEK=17&CATEGORY=overall&DISPLAY=points&TEAM=*&SORT=NAME"},null,"Guest",null,null,null,null,null,null,null,null,null,null,"Minimum Bid Start",{"$f":"MAX(AO2:AO500)","v":0},"Minimum Bid Increments:",{"$f":"MAX(AQ2:AQ500)","v":0},"Total Starters:",{"$f":"MAX(AS2:AS500)","v":0},"Number of Roster Spots:",{"$f":"(MAX(AU2:AU500))","v":0},"Number of Roster Spots:",{"$f":"(MAX(AW2:AW500))-AS1","v":0},"Starting Auction Funds Available To Each Franchise:",{"$f":"(MAX(AY2:AY500))","v":0},null,{"$f":"CONCATENATE(\"http://football33.myfantasyleague.com/\",'FADS v2.0'!B7,\"/options?L=\", 'FADS v2.0'!D13,\"&O=26\")","v":"http://football33.myfantasyleague.com//options?L=&O=26"}]
[null,null,null,null,null,null,null,null,null,null,null,null,null,null,null,null,null,null,null,null,null,null,null,null,null,null,{"$f":"CONCATENATE(\"http://football.myfantasyleague.com/\", 'FADS v2.0'!B7, \"/top?L=\", 'FADS v2.0'!D13, \"&SEARCHTYPE=BASIC&COUNT=1500&YEAR=\", Z1, \"&START_WEEK=1&END_WEEK=17&CATEGORY=overall&DISPLAY=points&TEAM=*&SORT=NAME\")","v":"http://football.myfantasyleague.com//top?L=&SEARCHTYPE=BASIC&COUNT=1500&YEAR=-1&START_WEEK=1&END_WEEK=17&CATEGORY=overall&DISPLAY=points&TEAM=*&SORT=NAME"},"Error","Help Center",null,null,null,null,null,null,null,null,null,null,null,{"$f":"IF(ISNUMBER(SEARCH(\"*Minimum Auction Opening Bid:*\",BA3)),BB3,\"\")","v":""},null,{"$f":"IF(ISNUMBER(SEARCH(\"*All Auction Bids Must Be In Increments Of:*\",BA3)),BB3,\"\")","v":""},null,{"$f":"IF(ISNUMBER(SEARCH(\"*Total Starters:*\",BA3)),BB3,\"\")","v":""},null,{"$f":"IF(ISNUMBER(SEARCH(\"Number of Roster Spots:*\",BA3)),BB3,\"\")","v":""},null,{"$f":"IF(ISNUMBER(SEARCH(\"Number of Roster Spots:*\",BA3)),BB3,\"\")","v":""},null,{"$f":"IF(ISNUMBER(SEARCH(\"*Starting Auction Funds Available To Each Franchise:*\",BA3)),BB3,\"\")","v":""}]
[null,null,null,null,null,null,null,null,null,null,null,null,null,null,null,null,null,null,null,null,null,null,null,null,null,null,null,null,null,null,null,null,null,null,null,null,null,null,null,null,{"$f":"IF(ISNUMBER(SEARCH(\"*Minimum Auction Opening Bid:*\",BA4)),BB4,\"\")","v":""},null,{"$f":"IF(ISNUMBER(SEARCH(\"*All Auction Bids Must Be In Increments Of:*\",BA4)),BB4,\"\")","v":""},null,"",null,{"$f":"IF(ISNUMBER(SEARCH(\"Number of Roster Spots:*\",BA4)),BB4,\"\")","v":""},null,{"$f":"IF(ISNUMBER(SEARCH(\"Number of Roster Spots:*\",BA4)),BB4,\"\")","v":""},null,{"$f":"IF(ISNUMBER(SEARCH(\"*Starting Auction Funds Available To Each Franchise:*\",BA4)),BB4,\"\")","v":""}]
[null,null,null,null,null,null,null,null,null,null,null,null,null,null,null,null,null,null,null,null,null,null,null,null,null,null,null,null,null,null,null,null,null,null,null,null,null,null,null,null,"",null,"",null,"",null,"",null,"",null,""]
["http://www.myfantasyleague.com/",null,"Guest (Login)",null,null,null,null,null,null,null,null,null,null,null,null,null,null,null,null,null,null,null,null,null,null,null,null,null,null,null,null,null,null,null,null,null,null,null,null,null,"",null,"",null,"",null,"",null,"",null,""]
[null,"Black Top Performers/Player Stats","Help Center",null,null,null,null,null,null,null,null,null,null,null,null,null,null,null,null,null,null,null,null,null,null,null,null,null,null,null,null,null,null,null,null,null,null,null,null,null,"",null,"",null,"",null,"",null,"",null,""]
[null,null,null,null,null,null,null,null,null,null,null,null,null,null,null,null,null,null,null,null,null,null,null,null,null,null,null,null,null,null,null,null,null,null,null,null,null,null,null,null,"",null,"",null,"",null,"",null,"",null,""]
[null,null,null,null,null,null,null,null,null,null,null,null,null,null,null,null,null,null,null,null,null,null,null,null,null,null,null,null,null,null,null,null,null,null,null,null,null,null,null,null,"",null,"",null,"",null,"",null,"",null,""]
[null,null,null,null,null,"Weekly Point Totals",null,null,null,null,null,null,null,null,null,null,null,null,null,null,null,null,null,null,null,null,null,null,null,null,null,null,null,null,null,null,null,null,null,null,"",null,"",null,"",null,"",null,"",null,""]
["#","Ovr","Player","Pts","Avg",1,2,3,4,5,6,7,8,9,10,11,12,13,14,15,16,17,"Status","Bye",null,null,null,null,null,null,null,null,null,null,null,null,null,null,null,null,"",null,"",null,"",null,"",null,"",null,""]
[1,1,"Abdul-Quddus, Isa NOS S",80.7,5.38,0,0,0,6,0.75,"B",3.75,1.5,7.25,4,4.5,3.75,null,15.7,16.5,6,11,"Free Agent",6,null,null,{"$f":"IF(ISBLANK(C11),\"\",C11)","v":"Abdul-Quddus, Isa NOS S"},null,null,null,null,null,null,null,null,null,null,null,null,null,"",null,"",null,"",null,"",null,"",null,""]
[2,2,"Abraham, John ATL DE",195.5,12.218999999999999,21.8,0,11.9,22,2.5,37.299999999999997,"B",16.399999999999999,5,1.25,27.5,5,16.600000000000001,2.5,9,8,8.75,"Free Agent",7,null,null,"Abraham, John ATL DE",null,null,null,null,null,null,null,null,null,null,null,null,null,"",null,"",null,"",null,"",null,"",null,""]
[3,3,"Acho, Sam ARI LB",110,6.875,1.5,10.75,12.75,11.35,3,3.25,11.75,4,3,"B",15.95,4.5,10.7,7.5,0,3.75,6.25,"Free Agent",10,null,null,"Acho, Sam ARI LB",null,null,null,null,null,null,null,null,null,null,null,null,null,"",null,"",null,"",null,"",null,"",null,""]
[4,4,"Adams, Joe CAR WR",9.0299999999999994,1.0029999999999999,1.1100000000000001,3.81,-1.8,null,null,"B",null,null,null,null,1.8,0,3.25,0.3,2.13,-1.57,null,"Free Agent",6,null,null,"Adams, Joe CAR WR",null,null,null,null,null,null,null,null,null,null,null,null,null,"",null,"",null,"",null,"",null,"",null,""]
[5,5,"Adams, Kris NYG WR",5.0999999999999996,1.7,5.0999999999999996,0,0,null,null,null,null,null,null,null,"B",null,null,null,null,null,null,"Free Agent (O)",11,null,null,"Adams, Kris NYG WR",null,null,null,null,null,null,null,null,null,null,null,null,null,"",null,"",null,"",null,"",null,"",null,""]
[6,6,"Adams, Kyle CHI TE",10,0.66700000000000004,3.2,null,2.2000000000000002,0,0,"B",0,0,0,2.2000000000000002,0,0,0,2.4,0,0,0,"Free Agent",6,null,null,"Adams, Kyle CHI TE",null,null,null,null,null,null,null,null,null,null,null,null,null,"",null,"",null,"",null,"",null,"",null,""]
[7,7,"Adams, Michael ARI CB",22.75,1.4219999999999999,11.25,0,0,0,1.5,0,0,0,2.5,"B",0,2.5,0,0,2.5,2.5,0,"Free Agent",10,null,null,"Adams, Michael ARI CB",null,null,null,null,null,null,null,null,null,null,null,null,null,"",null,"",null,"",null,"",null,"",null,""]
[8,8,"Adams, Mike DEN S",154.69999999999999,9.6690000000000005,13.5,11.5,15,7.75,16,16,"B",3.75,6.75,13.45,0,17.5,2.75,6,7.5,11,6.25,"Free Agent",7,null,null,"Adams, Mike DEN S",null,null,null,null,null,null,null,null,null,null,null,null,null,"",null,"",null,"",null,"",null,"",null,""]
[9,9,"Adams, Phillip OAK CB",49.26,3.2839999999999998,1,3.87,0.33,0,"B",0.75,3.4,4.03,1.5,0,0,1.1299999999999999,7.5,17.5,2.5,5.75,null,"Free Agent",5,null,null,"Adams, Phillip OAK CB",null,null,null,null,null,null,null,null,null,null,null,null,null,"",null,"",null,"",null,"",null,"",null,""]
[10,10,"Addison, Mario CAR LB",19.5,1.625,0,0,0,null,null,"B",0,0,0,null,null,0,null,0,12,7.5,0,"Free Agent",6,null,null,"Addison, Mario CAR LB",null,null,null,null,null,null,null,null,null,null,null,null,null,"",null,"",null,"",null,"",null,"",null,""]
[11,11,"Adibi, Xavier TEN LB",0,0,null,null,null,null,null,null,null,0,0,null,"B",null,0,0,null,0,0,"Free Agent",11,null,null,"Adibi, Xavier TEN LB",null,null,null,null,null,null,null,null,null,null,null,null,null,"",null,"",null,"",null,"",null,"",null,""]
[12,12,"Afalava, Al TEN S",24.75,2.0619999999999998,0,null,null,0,0,0,4.5,0,0,null,"B",null,0,7.5,0,2.25,10.5,"Free Agent",11,null,null,"Afalava, Al TEN S",null,null,null,null,null,null,null,null,null,null,null,null,null,"",null,"",null,"",null,"",null,"",null,""]
[13,13,"Aiken, Kamar NEP WR",0,0,null,null,null,null,null,null,null,null,"B",null,null,null,null,null,null,0,null,"Free Agent",9,null,null,"Aiken, Kamar NEP WR",null,null,null,null,null,null,null,null,null,null,null,null,null,"",null,"",null,"",null,"",null,"",null,""]
[14,14,"Ajirotutu, Seyi SDC WR",8.25,2.75,null,null,null,null,null,null,"B",null,4.05,null,null,4.2,0,null,null,null,null,"Free Agent",7,null,null,"Ajirotutu, Seyi SDC WR",null,null,null,null,null,null,null,null,null,null,null,null,null,"",null,"",null,"",null,"",null,"",null,""]
[15,15,"Akers, David SFO PK",126,7.875,16,9.5,6,9.5,9,2.5,7,6.5,"B",5,12,4,7,9,10,5.5,7.5,"Free Agent (P)",9,null,null,"Akers, David SFO PK",null,null,null,null,null,null,null,null,null,null,null,null,null,"",null,"",null,"",null,"",null,"",null,""]
[16,16,"Albright, Alex DAL LB",25.75,1.839,0,0,null,null,"B",5.5,0,0,1.5,0,0,0,0,3,7.5,3.75,4.5,"Free Agent (P)",5,null,null,"Albright, Alex DAL LB",null,null,null,null,null,null,null,null,null,null,null,null,null,"",null,"",null,"",null,"",null,"",null,""]
[17,17,"Alexander, Danario SDC WR",155.05000000000001,15.505000000000001,null,null,null,null,null,null,"B",0,9.85,26.65,30.35,13.65,17.7,29.55,0,16.649999999999999,10.65,"Free Agent",7,null,null,"Alexander, Danario SDC WR",null,null,null,null,null,null,null,null,null,null,null,null,null,"",null,"",null,"",null,"",null,"",null,""]
[18,18,"Alexander, Frank CAR DE",64,4,7.5,3.75,14.1,14.15,1.25,"B",0,4.5,1.75,0,0,5,0,0,3.25,3.75,5,"Free Agent",6,null,null,"Alexander, Frank CAR DE",null,null,null,null,null,null,null,null,null,null,null,null,null,"",null,"",null,"",null,"",null,"",null,""]
[19,19,"Alexander, Lorenzo WAS LB",51.35,3.2090000000000001,0,0,0,0,0,18.8,4.5,0,1.5,"B",2.25,2.25,1.5,2.25,1.5,14.55,2.25,"Free Agent",10,null,null,"Alexander, Lorenzo WAS LB",null,null,null,null,null,null,null,null,null,null,null,null,null,"",null,"",null,"",null,"",null,"",null,""]
[20,20,"Alexander, Mister HOU LB",0,0,0,0,0,null,0,0,0,"B",null,null,null,null,null,null,null,null,null,"Free Agent",8,null,null,"Alexander, Mister HOU LB",null,null,null,null,null,null,null,null,null,null,null,null,null,"",null,"",null,"",null,"",null,"",null,""]
[21,21,"Allen, Anthony BAL RB",17.54,1.0960000000000001,1.3,0,0,0,0,0,0,"B",0,0.72,0.72,0,0,0,0.8,2.2000000000000002,11.8,"Free Agent",8,null,null,"Allen, Anthony BAL RB",null,null,null,null,null,null,null,null,null,null,null,null,null,"",null,"",null,"",null,"",null,"",null,""]
[22,22,"Allen, Antonio NYJ S",13.2,1.8859999999999999,null,null,null,null,null,7.7,3.25,0,"B",null,null,null,null,0,0,0,2.25,"Free Agent",9,null,null,"Allen, Antonio NYJ S",null,null,null,null,null,null,null,null,null,null,null,null,null,"",null,"",null,"",null,"",null,"",null,""]
[23,23,"Allen, Armando CHI RB",23.4,1.56,0,-0.3,0.2,0,12.9,"B",0,0.4,3.2,0,0,0.2,0,0.3,3,3.5,null,"Free Agent (Q)",6,null,null,"Allen, Armando CHI RB",null,null,null,null,null,null,null,null,null,null,null,null,null,"",null,"",null,"",null,"",null,"",null,""]
[24,24,"Allen, Cortez PIT CB",111.35,7.423,3,4,6.75,"B",1.5,7,0.75,4,2.5,0,3,4.5,12.75,11.75,null,30.85,19,"Free Agent (Q)",4,null,null,"Allen, Cortez PIT CB",null,null,null,null,null,null,null,null,null,null,null,null,null,"",null,"",null,"",null,"",null,"",null,""]
[25,25,"Allen, Dwayne IND TE",138.6,8.6620000000000008,0,7.8,11,"B",15.8,6.3,2.4,8.6,17.5,6.1,15.9,9.1,10,2.6,14.1,6.3,5.0999999999999996,"Polk High (Q)",4,null,null,"Allen, Dwayne IND TE",null,null,null,null,null,null,null,null,null,null,null,null,null,"",null,"",null,"",null,"",null,"",null,""]
[26,26,"Allen, Jared MIN DE",199.3,12.456,0,11,12.2,21,12.1,18.649999999999999,18.75,14,11,2.5,"B",11.25,26.05,8.5,2.5,18.100000000000001,11.7,"BELAC (P)",11,null,null,"Allen, Jared MIN DE",null,null,null,null,null,null,null,null,null,null,null,null,null,"",null,"",null,"",null,"",null,"",null,""]
[27,27,"Allen, Jason CIN CB",3,0.75,null,null,3,null,null,null,null,"B",null,null,null,null,null,0,0,0,null,"Free Agent",8,null,null,"Allen, Jason CIN CB",null,null,null,null,null,null,null,null,null,null,null,null,null,"",null,"",null,"",null,"",null,"",null,""]
[28,28,"Allen, Nate PHI S",103.75,6.9169999999999998,6.75,16.75,3.75,7,13.75,1.5,"B",12.75,null,5.25,7.5,4.5,8.25,6.75,9.25,0,0,"Free Agent",7,null,null,"Allen, Nate PHI S",null,null,null,null,null,null,null,null,null,null,null,null,null,"",null,"",null,"",null,"",null,"",null,""]
[29,29,"Allen, Russell JAC LB",204.3,12.769,8.5,18.75,18,14.25,5.25,"B",8.5,12.25,9,9,19.5,15.75,15,8.5,11.5,15.55,15,"Polk High (Q)",6,null,null,"Allen, Russell JAC LB",null,null,null,null,null,null,null,null,null,null,null,null,null,"",null,"",null,"",null,"",null,"",null,""]
[30,30,"Allen, Will PIT S",45,2.8119999999999998,0,0,0.75,"B",0,12.75,1.5,13.5,6,4.5,1.5,3,1.5,0,0,0,0,"Free Agent",4,null,null,"Allen, Will PIT S",null,null,null,null,null,null,null,null,null,null,null,null,null,"",null,"",null,"",null,"",null,"",null,""]
[31,31,"Alualu, Tyson JAC DT",127.85,7.9909999999999997,14.75,16,4.25,5,5,"B",2.5,2.5,7.5,21.6,5,2.5,8.75,7.5,9.25,12,3.75,"Free Agent",6,null,null,"Alualu, Tyson JAC DT",null,null,null,null,null,null,null,null,null,null,null,null,null,"",null,"",null,"",null,"",null,"",null,""]
[32,32,"Amaya, Jonathon MIA S",0,0,null,null,null,0,0,0,"B",0,0,0,0,0,null,0,0,0,0,"Free Agent (P)",7,null,null,"Amaya, Jonathon MIA S",null,null,null,null,null,null,null,null,null,null,null,null,null,"",null,"",null,"",null,"",null,"",null,""]
[33,33,"Amendola, Danny STL WR",171.11,15.555,13.85,43.88,14.18,21.28,7.58,null,null,null,"B",25.04,12.85,5.05,null,null,22.17,0,5.23,"Rancho Cucamonga Ghosts",9,null,null,"Amendola, Danny STL WR",null,null,null,null,null,null,null,null,null,null,null,null,null,"",null,"",null,"",null,"",null,"",null,""]
[34,34,"Amukamara, Prince NYG CB",96,7.3849999999999998,null,null,4,8.5,3.75,21.5,10.75,7.5,4.5,12.75,"B",7,6.75,3,null,0,6,"Free Agent",11,null,null,"Amukamara, Prince NYG CB",null,null,null,null,null,null,null,null,null,null,null,null,null,"",null,"",null,"",null,"",null,"",null,""]
[35,35,"Anderson, Colt PHI S",52.65,3.7610000000000001,null,0,0,null,0,0,"B",0,0,3,0,0,0,8.25,9.25,17.899999999999999,14.25,"Free Agent",7,null,null,"Anderson, Colt PHI S",null,null,null,null,null,null,null,null,null,null,null,null,null,"",null,"",null,"",null,"",null,"",null,""]
[36,36,"Anderson, Derek CAR QB",2.3199999999999998,1.1599999999999999,null,null,1.84,null,null,"B",null,null,null,null,null,null,null,null,null,null,0.48,"Free Agent",6,null,null,"Anderson, Derek CAR QB",null,null,null,null,null,null,null,null,null,null,null,null,null,"",null,"",null,"",null,"",null,"",null,""]
[37,37,"Anderson, Jamaal CIN DE",5,2.5,0,5,null,null,null,null,null,"B",null,null,null,null,null,null,null,null,null,"Free Agent",8,null,null,"Anderson, Jamaal CIN DE",null,null,null,null,null,null,null,null,null,null,null,null,null,"",null,"",null,"",null,"",null,"",null,""]
[38,38,"Anderson, James CAR LB",91,7.5830000000000002,7.5,8.25,16.75,3.75,4.5,"B",18.25,3.75,7,7.75,8.25,0.75,4.5,null,null,null,null,"Free Agent",6,null,null,"Anderson, James CAR LB",null,null,null,null,null,null,null,null,null,null,null,null,null,"",null,"",null,"",null,"",null,"",null,""]
[39,39,"Anderson, Joe CHI WR",0,0,null,null,null,null,null,"B",null,null,null,null,null,null,null,null,0,0,0,"Free Agent",6,null,null,"Anderson, Joe CHI WR",null,null,null,null,null,null,null,null,null,null,null,null,null,"",null,"",null,"",null,"",null,"",null,""]
[40,40,"Anderson, Mark BUF DE",34.35,5.7249999999999996,0,11,12.1,3.75,7.5,0,null,"B",null,null,null,null,null,null,null,null,null,"Free Agent",8,null,null,"Anderson, Mark BUF DE",null,null,null,null,null,null,null,null,null,null,null,null,null,"",null,"",null,"",null,"",null,"",null,""]
[41,41,"Angerer, Pat IND LB",43.75,3.9769999999999999,null,null,null,"B",null,null,3.75,4,2.25,1.5,3.75,0,2,3.75,7.5,12.25,3,"Free Agent (Q)",4,null,null,"Angerer, Pat IND LB",null,null,null,null,null,null,null,null,null,null,null,null,null,"",null,"",null,"",null,"",null,"",null,""]
[42,42,"Applewhite, Antwan CAR DE",15.15,3.03,1.25,1.25,0,null,12.65,"B",0,null,null,null,null,null,null,null,null,null,null,"Free Agent",6,null,null,"Applewhite, Antwan CAR DE",null,null,null,null,null,null,null,null,null,null,null,null,null,"",null,"",null,"",null,"",null,"",null,""]
[43,43,"Arenas, Javier KCC CB",139.69,8.7309999999999999,4.09,8.02,7.99,8.1,2.0299999999999998,1.48,"B",6.93,13.75,9.8800000000000008,6.5,14.03,5.5,11.58,18.559999999999999,7,14.25,"Free Agent (P)",7,null,null,"Arenas, Javier KCC CB",null,null,null,null,null,null,null,null,null,null,null,null,null,"",null,"",null,"",null,"",null,"",null,""]
[44,44,"Armstrong, Anthony DAL WR",4.95,0.82499999999999996,1.55,null,3.4,0,"B",0,null,null,null,null,null,null,null,null,0,null,null,"Free Agent",5,null,null,"Armstrong, Anthony DAL WR",null,null,null,null,null,null,null,null,null,null,null,null,null,"",null,"",null,"",null,"",null,"",null,""]
[45,45,"Aromashodu, Devin MIN WR",31.95,2.13,9.85,3.15,4.9000000000000004,0,7.15,2.5499999999999998,0,null,0,4.3499999999999996,"B",0,0,0,0,0,0,"Free Agent",11,null,null,"Aromashodu, Devin MIN WR",null,null,null,null,null,null,null,null,null,null,null,null,null,"",null,"",null,"",null,"",null,"",null,""]
[46,46,"Arrington, Kyle NEP CB",122.75,7.6719999999999997,5.5,3,10.5,7,5.25,3,11.5,0,"B",11.75,11,10.5,12,6.5,3,11.5,10.75,"Free Agent",9,null,null,"Arrington, Kyle NEP CB",null,null,null,null,null,null,null,null,null,null,null,null,null,"",null,"",null,"",null,"",null,"",null,""]
[47,47,"Asiata, Matt MIN RB",4.3,0.26900000000000002,2.8,0,0,0,0.8,0,0,0,0,0,"B",0.6,0,0,0,0.1,0,"Free Agent",11,null,null,"Asiata, Matt MIN RB",null,null,null,null,null,null,null,null,null,null,null,null,null,"",null,"",null,"",null,"",null,"",null,""]
[48,48,"Asomugha, Nnamdi PHI CB",113,7.0620000000000003,9,1.5,5.5,5.5,11.25,19.25,"B",4.5,3.75,4.75,4.5,3.75,11.25,11.5,2.5,4.5,10,"Free Agent",7,null,null,"Asomugha, Nnamdi PHI CB",null,null,null,null,null,null,null,null,null,null,null,null,null,"",null,"",null,"",null,"",null,"",null,""]
[49,49,"Atkins, Geno CIN DT",222,13.875,18.5,3.75,17.25,20.2,16.649999999999999,13,10.55,"B",11,6.75,29.6,13.45,8.4,17.45,0,27.95,7.5,"Angry Neighbors",8,null,null,"Atkins, Geno CIN DT",null,null,null,null,null,null,null,null,null,null,null,null,null,"",null,"",null,"",null,"",null,"",null,""]
[50,50,"Ausberry, David OAK TE",20.7,1.294,3.7,4.5999999999999996,2.8,2.4,"B",2.7,0,0,0,4.5,0,0,0,0,0,0,0,"Free Agent (P)",5,null,null,"Ausberry, David OAK TE",null,null,null,null,null,null,null,null,null,null,null,null,null,"",null,"",null,"",null,"",null,"",null,""]
[51,51,"Austin, Marvin NYG DT",16.75,2.3929999999999998,null,null,0,0,3,0,5,null,null,null,"B",null,null,null,null,2.5,6.25,"Free Agent",11,null,null,"Austin, Marvin NYG DT",null,null,null,null,null,null,null,null,null,null,null,null,null,"",null,"",null,"",null,"",null,"",null,""]
[52,52,"Austin, Miles DAL WR",210.8,13.175000000000001,18.3,18.55,17.95,16.7,"B",5.6,18.95,24.55,16.350000000000001,5.7,13.3,0,13.1,9.6,16.649999999999999,15.5,0,"BELAC",5,null,null,"Austin, Miles DAL WR",null,null,null,null,null,null,null,null,null,null,null,null,null,"",null,"",null,"",null,"",null,"",null,""]
[53,53,"Avant, Jason PHI WR",128.05000000000001,9.1460000000000008,7.7,5.8,7.55,5.5,7.15,4.5999999999999996,"B",6.5,13.1,1.1499999999999999,null,null,12.9,22.05,8.15,17,8.9,"Free Agent",7,null,null,"Avant, Jason PHI WR",null,null,null,null,null,null,null,null,null,null,null,null,null,"",null,"",null,"",null,"",null,"",null,""]
[54,54,"Avery, Donnie IND WR",173,10.811999999999999,13.45,24.05,5.3,"B",5.95,10.9,9.6,9.1999999999999993,18.05,12.5,7.15,3.85,28.35,7.15,7.45,10.050000000000001,0,"Free Agent",4,null,null,"Avery, Donnie IND WR",null,null,null,null,null,null,null,null,null,null,null,null,null,"",null,"",null,"",null,"",null,"",null,""]
[55,55,"Avril, Cliff DET DE",154.35,9.6470000000000002,9.75,0,11.5,13.25,"B",24.1,15.25,2.5,2.5,5,10.25,21.9,15.2,11.9,2.5,1.25,7.5,"Angry Neighbors",5,null,null,"Avril, Cliff DET DE",null,null,null,null,null,null,null,null,null,null,null,null,null,"",null,"",null,"",null,"",null,"",null,""]
[56,56,"Ayanbadejo, Brendon BAL LB",46.2,2.8879999999999999,0,0,0,0,0,1.5,0,"B",0,2.5,0,7.75,3,7.5,10.5,9.6999999999999993,3.75,"Free Agent",8,null,null,"Ayanbadejo, Brendon BAL LB",null,null,null,null,null,null,null,null,null,null,null,null,null,"",null,"",null,{"$f":"IF(ISNUMBER(SEARCH(\"*Total Starters:*\",BA67)),BB67,\"\")","v":""},null,"",null,"",null,""]
[57,57,"Ayers, Akeem TEN LB",197.95,12.372,13.75,15.25,28.8,12.25,5.75,7,5.25,16.7,18,11.7,"B",12.7,8.75,3.25,13.55,6.75,18.5,"Invictus",11,null,null,"Ayers, Akeem TEN LB",null,null,null,null,null,null,null,null,null,null,null,null,null,{"$f":"IF(ISNUMBER(SEARCH(\"*Minimum Auction Opening Bid:*\",BA68)),BB68,\"\")","v":""},null,{"$f":"IF(ISNUMBER(SEARCH(\"*All Auction Bids Must Be In Increments Of:*\",BA68)),BB68,\"\")","v":""},null,"",null,{"$f":"IF(ISNUMBER(SEARCH(\"Number of Roster Spots:*\",BA68)),BB68,\"\")","v":""},null,{"$f":"IF(ISNUMBER(SEARCH(\"Number of Roster Spots:*\",BA68)),BB68,\"\")","v":""},null,{"$f":"IF(ISNUMBER(SEARCH(\"*Starting Auction Funds Available To Each Franchise:*\",BA68)),BB68,\"\")","v":""}]
[58,58,"Ayers, Robert DEN DE",49.8,3.32,3.75,0,0,1.25,0,1.25,"B",0,1.25,22.2,3.75,0,null,3.5,9.1,0,3.75,"Free Agent (P)",7,null,null,"Ayers, Robert DEN DE",null,null,null,null,null,null,null,null,null,null,null,null,null,"",null,"",null,"",null,"",null,"",null,""]
[59,59,"Babin, Jason JAC DE",147.55000000000001,9.2219999999999995,19,2.5,23.05,2.5,5,"B",null,2.5,16.5,0,11.8,16,8.5,16.7,7.75,7.25,3.5,"BELAC (P)",6,null,null,"Babin, Jason JAC DE",null,null,null,null,null,null,null,null,null,null,null,null,null,"",null,"",null,"",null,"",null,"",null,""]
[60,60,"Babineaux, Jonathan ATL DT",130.30000000000001,8.1440000000000001,11.1,8.6999999999999993,2.5,8.5,9.5500000000000007,19.5,"B",3.5,24.9,2.5,13,4.75,8.3000000000000007,0,3.75,3.75,6,"BELAC",7,null,null,"Babineaux, Jonathan ATL DT",null,null,null,null,null,null,null,null,null,null,null,null,null,"",null,"",null,"",null,"",null,"",null,""]
[61,61,"Babineaux, Jordan TEN S",130.5,8.1560000000000006,3,2.25,11,12.75,16.75,12,17.5,12.75,4.5,0.75,"B",6,10.75,10.5,9.25,0.75,0,"Free Agent",11,null,null,"Babineaux, Jordan TEN S",null,null,null,null,null,null,null,null,null,null,null,null,null,"",null,"",null,"",null,"",null,"",null,""]
[62,62,"Bademosi, Johnson CLE S",7,0.438,0,0,0,0,0,0,0,0,0,"B",7,0,0,0,0,0,0,"Free Agent",10,null,null,"Bademosi, Johnson CLE S",null,null,null,null,null,null,null,null,null,null,null,null,null,"",null,"",null,"",null,"",null,"",null,""]
[63,63,"Bailey, Allen KCC DE",12.5,1.25,null,null,0,0,5,0,"B",1.75,1.25,4.5,0,0,0,null,null,null,null,"Free Agent",7,null,null,"Bailey, Allen KCC DE",null,null,null,null,null,null,null,null,null,null,null,null,null,"",null,"",null,"",null,"",null,"",null,""]
[64,64,"Bailey, Champ DEN CB",130.55000000000001,8.1590000000000007,4,5.25,1.5,10,5.25,7,"B",14,15.75,4.5,12,11.5,7.75,12.3,11.5,3.75,4.5,"Free Agent",7,null,null,"Bailey, Champ DEN CB",null,null,null,null,null,null,null,null,null,null,null,null,null,"",null,"",null,"",null,"",null,"",null,""]
[65,65,"Bailey, Dan DAL PK",132,8.25,6,1,10,4,"B",12,13.5,7.5,7,8,11.5,12.5,8,8.5,10.5,7.5,4.5,"Free Agent",5,null,null,{"$f":"IF(ISBLANK(C75),\"\",C75)","v":"Bailey, Dan DAL PK"},null,null,null,null,null,null,null,null,null,null,null,null,null,"",null,"",null,"",null,"",null,"",null,""]
[66,66,"Bailey, Patrick TEN LB",0,0,0,0,0,0,null,null,0,null,null,0,"B",0,0,0,0,0,0,"Free Agent",11,null,null,"Bailey, Patrick TEN LB",null,null,null,null,null,null,null,null,null,null,null,null,null,"",null,"",null,"",null,"",null,"",null,""]
[67,67,"Bajema, Billy BAL TE",0,0,null,null,null,null,null,0,null,"B",null,null,0,0,0,0,0,0,0,"Free Agent",8,null,null,"Bajema, Billy BAL TE",null,null,null,null,null,null,null,null,null,null,null,null,null,"",null,"",null,"",null,"",null,"",null,""]
[68,68,"Baldwin, Doug SEA WR",92.97,6.641,3,2.0499999999999998,null,2.25,7.57,16.899999999999999,4,null,1.85,7.95,"B",2.65,9.6,5.4,2.0499999999999998,23.3,4.4000000000000004,"Free Agent",11,null,null,"Baldwin, Doug SEA WR",null,null,null,null,null,null,null,null,null,null,null,null,null,"",null,"",null,"",null,"",null,"",null,""]
[69,69,"Baldwin, Jon KCC WR",64.5,4.3,0,9.9499999999999993,7.35,10,3.85,4.4000000000000004,"B",1.95,2.5499999999999998,2.35,null,0,12.2,0,0,9.9,0,"Free Agent",7,null,null,"Baldwin, Jon KCC WR",null,null,null,null,null,null,null,null,null,null,null,null,null,"",null,"",null,"",null,"",null,"",null,""]
[70,70,"Ball, Alan HOU CB",21.75,1.9770000000000001,0,0,0,6,0,0,0,"B",0,0,2.5,13.25,null,null,null,null,null,"Free Agent",8,null,null,"Ball, Alan HOU CB",null,null,null,null,null,null,null,null,null,null,null,null,null,"",null,"",null,"",null,"",null,"",null,""]
[71,71,"Ball, Lance DEN RB",38.9,2.593,1.4,3.1,2.8,9.4,0.1,0,"B",1.4,1.7,0,6.6,0,-0.2,0,null,0,12.6,"Free Agent",7,null,null,"Ball, Lance DEN RB",null,null,null,null,null,null,null,null,null,null,null,null,null,"",null,"",null,"",null,"",null,"",null,""]
[72,72,"Ballard, Christian MIN DT",35.4,2.2120000000000002,2.5,3.75,0,3,0,0,0,5.5,0,0,"B",6.25,0,0,14.4,0,0,"Free Agent (P)",11,null,null,"Ballard, Christian MIN DT",null,null,null,null,null,null,null,null,null,null,null,null,null,"",null,"",null,"",null,"",null,"",null,""]
[73,73,"Ballard, Vick IND RB",130.6,8.1620000000000008,0.6,1.3,1.2,"B",2.5,6.2,11.3,14.1,12.8,7.9,8.9,4.0999999999999996,15.2,11.4,10.5,5.9,16.7,"BELAC",4,null,null,"Ballard, Vick IND RB",null,null,null,null,null,null,null,null,null,null,null,null,null,"",null,"",null,"",null,"",null,"",null,""]
[74,74,"Banks, Brandon WAS WR",42.55,3.5459999999999998,2.08,1.92,10.08,1.1299999999999999,5.99,-0.33,0.8,6.15,4.03,"B",3.98,4.5199999999999996,2.2000000000000002,null,null,null,null,"Free Agent",10,null,null,"Banks, Brandon WAS WR",null,null,null,null,null,null,null,null,null,null,null,null,null,"",null,"",null,"",null,"",null,"",null,""]
[75,75,"Bannan, Justin DEN DT",104.5,6.5309999999999997,3.75,5,14.5,0,8.75,16.25,"B",2.5,8.75,7.5,6.25,10,3.75,3.5,6.5,6.25,1.25,"Free Agent",7,null,null,"Bannan, Justin DEN DT",null,null,null,null,null,null,null,null,null,null,null,null,null,"",null,"",null,"",null,"",null,"",null,""]
[76,76,"Barber, Ronde TBB S",209.95,13.122,24.6,12.75,6,5.25,"B",33.549999999999997,18,16.75,12.5,10.25,6,21.8,7.5,14.5,8.25,6.25,6,"Free Agent",5,null,null,"Barber, Ronde TBB S",null,null,null,null,null,null,null,null,null,null,null,null,null,"",null,"",null,"",null,"",null,"",null,""]
[77,77,"Barden, Brandon TEN TE",0,0,null,null,null,null,null,null,null,null,null,null,"B",null,null,null,0,0,0,"Free Agent",11,null,null,"Barden, Brandon TEN TE",null,null,null,null,null,null,null,null,null,null,null,null,null,"",null,"",null,"",null,"",null,"",null,""]
[78,78,"Barden, Ramses NYG WR",39.5,3.2919999999999998,0,3.65,25.05,6.1,null,0,0,0,0,4.7,"B",0,0,0,null,null,null,"Free Agent",11,null,null,"Barden, Ramses NYG WR",null,null,null,null,null,null,null,null,null,null,null,null,null,"",null,"",null,"",null,"",null,"",null,""]
[79,79,"Barnes, Antwan SDC LB",42.9,3.9,2.5,0.75,9.65,2.5,0,1.5,"B",2.5,1.5,null,2.5,19.5,0,null,null,null,null,"Free Agent",7,null,null,"Barnes, Antwan SDC LB",null,null,null,null,null,null,null,null,null,null,null,null,null,"",null,"",null,"",null,"",null,"",null,""]
[80,80,"Barnes, Kevin FA CB",0,0,0,0,null,null,null,null,null,null,null,null,null,null,null,null,null,null,null,"Free Agent","-",null,null,"Barnes, Kevin FA CB",null,null,null,null,null,null,null,null,null,null,null,null,null,"",null,"",null,"",null,"",null,"",null,""]
[81,81,"Barnett, Nick BUF LB",167.8,10.488,10.5,9.75,11.25,18.75,9,19.8,12,"B",6.75,8,5.25,10,9.5,13.25,6,5.25,12.75,"Free Agent",8,null,null,"Barnett, Nick BUF LB",null,null,null,null,null,null,null,null,null,null,null,null,null,"",null,"",null,"",null,"",null,"",null,""]
[82,82,"Barnidge, Gary CAR TE",22.8,1.425,0,0,0,0,0,"B",0,2.2000000000000002,2.8,2.2999999999999998,0,9.9,0,2.1,3.5,0,0,"Free Agent (Q)",6,null,null,"Barnidge, Gary CAR TE",null,null,null,null,null,null,null,null,null,null,null,null,null,"",null,"",null,"",null,"",null,"",null,""]
[83,83,"Barron, Mark TBB S",161.44999999999999,10.090999999999999,9.5,18,11.5,15.75,"B",21.2,12.25,2.25,4.5,11.5,5.5,6.75,5.25,3.75,16,12.25,5.5,"Hurry Up and Happy Birthday, Donny",5,null,null,"Barron, Mark TBB S",null,null,null,null,null,null,null,null,null,null,null,null,null,"",null,"",null,"",null,"",null,"",null,""]
[84,84,"Bartell, Ronald DET CB",48.25,6.8929999999999998,3.75,null,null,null,"B",null,null,null,null,7,3.75,8,3,8.5,null,null,14.25,"Free Agent",5,null,null,"Bartell, Ronald DET CB",null,null,null,null,null,null,null,null,null,null,null,null,null,"",null,"",null,"",null,"",null,"",null,""]
[85,85,"Barth, Connor TBB PK",134,8.9329999999999998,10.5,12,4,13.5,"B",8,3,12.5,3,11,9,12,14,3,null,7.5,11,"Free Agent",5,null,null,"Barth, Connor TBB PK",null,null,null,null,null,null,null,null,null,null,null,null,null,"",null,"",null,"",null,"",null,"",null,""]
[86,86,"Barwin, Connor HOU LB",98.75,6.1719999999999997,4.5,1.5,5.5,0,4,8,17.2,"B",11.35,10,4.75,4.5,1.5,3,14.7,3.75,4.5,"Free Agent",8,null,null,"Barwin, Connor HOU LB",null,null,null,null,null,null,null,null,null,null,null,null,null,"",null,"",null,"",null,"",null,"",null,""]
[87,87,"Bass, Ben DAL DE",1.25,0.625,null,null,null,null,"B",null,null,null,null,null,1.25,0,null,null,null,null,null,"Free Agent",5,null,null,"Bass, Ben DAL DE",null,null,null,null,null,null,null,null,null,null,null,null,null,"",null,"",null,"",null,"",null,"",null,""]
[88,88,"Batch, Baron PIT RB",18,1.5,-0.1,0.1,5.2,"B",0,9.5,0.4,1.9,0.7,0,0.3,null,null,null,0,0,null,"Free Agent",4,null,null,"Batch, Baron PIT RB",null,null,null,null,null,null,null,null,null,null,null,null,null,"",null,"",null,"",null,"",null,"",null,""]
[89,89,"Batch, Charlie PIT QB",10,5,null,null,null,"B",null,null,null,null,null,null,null,-2.04,12.04,null,null,null,null,"Free Agent",4,null,null,"Batch, Charlie PIT QB",null,null,null,null,null,null,null,null,null,null,null,null,null,"",null,"",null,"",null,"",null,"",null,""]
[90,90,"Battle, Jackie SDC RB",81.900000000000006,5.1189999999999998,0,18.899999999999999,6.5,24.1,3.7,0.3,"B",0.6,2,2.1,0.8,2.2000000000000002,0,0.1,3.4,6.4,10.8,"Free Agent",7,null,null,"Battle, Jackie SDC RB",null,null,null,null,null,null,null,null,null,null,null,null,null,"",null,"",null,"",null,"",null,"",null,""]
[91,91,"Beasley, Cole DAL WR",31.55,3.1549999999999998,0,null,null,3.9,"B",null,null,0,2.0499999999999998,1.55,2.0499999999999998,15.55,2.5499999999999998,null,3.9,null,0,"Free Agent (Q)",5,null,null,"Beasley, Cole DAL WR",null,null,null,null,null,null,null,null,null,null,null,null,null,"",null,"",null,"",null,"",null,"",null,""]
[92,92,"Beason, Jon CAR LB",42.2,10.55,14.75,16.95,5.25,5.25,null,"B",null,null,null,null,null,null,null,null,null,null,null,"Angry Neighbors (P)",6,null,null,"Beason, Jon CAR LB",null,null,null,null,null,null,null,null,null,null,null,null,null,"",null,"",null,"",null,"",null,"",null,""]
[93,93,"Beckum, Travis NYG TE",0,0,null,null,null,null,null,null,null,null,0,0,"B",0,null,null,0,null,null,"Free Agent",11,null,null,"Beckum, Travis NYG TE",null,null,null,null,null,null,null,null,null,null,null,null,null,"",null,"",null,"",null,"",null,"",null,""]
[94,94,"Bell, Joique DET RB",158.06,9.8789999999999996,6.1,10.3,10.7,13.4,"B",5.0999999999999996,2.9,9.8000000000000007,19.899999999999999,11.8,1.9,10.7,14.2,14.6,5.7,17.3,3.66,"Roddy White Man Can't Jump",5,null,null,"Bell, Joique DET RB",null,null,null,null,null,null,null,null,null,null,null,null,null,"",null,"",null,"",null,"",null,"",null,""]
[95,95,"Bell, Kahlil CHI RB",7.9,1.129,null,null,4.0999999999999996,1.2,null,"B",null,null,null,null,0,null,-1.8,0,null,3.2,1.2,"Free Agent",6,null,null,"Bell, Kahlil CHI RB",null,null,null,null,null,null,null,null,null,null,null,null,null,"",null,"",null,"",null,"",null,"",null,""]
[96,96,"Bell, Yeremiah NYJ S",138.05000000000001,8.6280000000000001,10.25,12.75,9,6,10.5,12,7.5,9.25,"B",8.25,12.5,6.75,0.75,8.25,15.05,2.25,7,"Free Agent",9,null,null,"Bell, Yeremiah NYJ S",null,null,null,null,null,null,null,null,null,null,null,null,null,"",null,"",null,"",null,"",null,"",null,""]
[97,97,"Bellamy, Josh KCC WR",2.96,0.98699999999999999,null,null,null,null,null,null,"B",null,null,null,null,null,null,1.24,1.72,0,null,"Free Agent",7,null,null,"Bellamy, Josh KCC WR",null,null,null,null,null,null,null,null,null,null,null,null,null,"",null,"",null,"",null,"",null,"",null,""]
[98,98,"Bellore, Nick NYJ LB",0.32,0.02,0,0,0,0,0,0,0,0,"B",0,0,0,0,0,0,0,0.32,"Free Agent",9,null,null,"Bellore, Nick NYJ LB",null,null,null,null,null,null,null,null,null,null,null,null,null,"",null,"",null,"",null,"",null,"",null,""]
[99,99,"Benjamin, Travis CLE WR",88.88,6.3490000000000002,5.95,1.5,12.9,9.65,null,null,7.05,1,3.15,"B",0,1.17,1.85,13.7,15.15,8.35,7.46,"Free Agent",10,null,null,"Benjamin, Travis CLE WR",null,null,null,null,null,null,null,null,null,null,null,null,null,"",null,"",null,"",null,"",null,"",null,""]
[100,100,"Benn, Arrelious TBB WR",18.440000000000001,2.3050000000000002,null,4.2,2.65,6.05,"B",1.44,0.84,0.9,2.36,null,0,null,null,null,null,null,null,"Free Agent (I)",5,null,null,"Benn, Arrelious TBB WR",null,null,null,null,null,null,null,null,null,null,null,null,null,"",null,"",null,"",null,"",null,"",null,""]
[101,101,"Bennett, Earl CHI WR",87.84,7.32,8.75,4.5999999999999996,2.35,null,null,"B",6.58,9.17,7.2,2.15,1.85,9.5,8.69,null,null,2.85,24.15,"Free Agent (Q)",6,null,null,"Bennett, Earl CHI WR",null,null,null,null,null,null,null,null,null,null,null,null,null,"",null,"",null,"",null,"",null,"",null,""]
[102,102,"Bennett, Martellus NYG TE",175.1,10.944000000000001,16,20.7,22.3,1.7,7.5,2.4,15.4,8.9,8.5,9.6999999999999993,"B",8.9,21.7,16.7,3,8.6999999999999993,3,"Invictus",11,null,null,"Bennett, Martellus NYG TE",null,null,null,null,null,null,null,null,null,null,null,null,null,"",null,"",null,"",null,"",null,"",null,""]
[103,103,"Bennett, Michael TBB DE",177.45,11.090999999999999,14.2,1.25,29.25,11.2,"B",5,3.5,22.25,9.1999999999999993,8.5,19.05,2.5,7.25,25.3,6,5.5,7.5,"Free Agent (P)",5,null,null,"Bennett, Michael TBB DE",null,null,null,null,null,null,null,null,null,null,null,null,null,"",null,"",null,"",null,"",null,"",null,""]
[104,104,"Benson, Cedric GBP RB",53.5,10.7,1.8,15.6,15.4,14.6,6.1,null,null,null,null,"B",null,null,null,null,null,null,null,"Free Agent",10,null,null,"Benson, Cedric GBP RB",null,null,null,null,null,null,null,null,null,null,null,null,null,"",null,"",null,"",null,"",null,"",null,""]
[105,105,"Bentley, Dwight DET CB",21,5.25,1.5,null,8.25,6.75,"B",4.5,null,null,null,null,null,null,null,null,null,null,null,"Free Agent",5,null,null,"Bentley, Dwight DET CB",null,null,null,null,null,null,null,null,null,null,null,null,null,"",null,"",null,"",null,"",null,"",null,""]
[106,106,"Bequette, Jake NEP DE",0,0,null,null,null,0,null,null,null,0,"B",null,null,null,0,null,null,null,null,"Free Agent",9,null,null,"Bequette, Jake NEP DE",null,null,null,null,null,null,null,null,null,null,null,null,null,"",null,"",null,"",null,"",null,"",null,""]
[107,107,"Bernard, Rocky NYG DT",65.3,5.4420000000000002,13.05,11.25,4.75,7.5,null,null,null,null,7.5,1.25,"B",1.25,5,1.25,6.25,6.25,0,"Free Agent",11,null,null,"Bernard, Rocky NYG DT",null,null,null,null,null,null,null,null,null,null,null,null,null,"",null,"",null,"",null,"",null,"",null,""]
[108,108,"Bernstine, Jordan WAS S",0,0,0,null,null,null,null,null,null,null,null,"B",null,null,null,null,null,null,null,"Free Agent",10,null,null,"Bernstine, Jordan WAS S",null,null,null,null,null,null,null,null,null,null,null,null,null,"",null,"",null,"",null,"",null,"",null,""]
[109,109,"Berry, Aaron NYJ CB",0,0,null,null,null,null,0,0,0,0,"B",0,0,null,null,0,null,null,null,"Free Agent (I)",9,null,null,"Berry, Aaron NYJ CB",null,null,null,null,null,null,null,null,null,null,null,null,null,"",null,"",null,"",null,"",null,"",null,""]
[110,110,"Berry, Eric KCC S",158.25,9.891,5.5,5.75,9.75,9,7.5,5.75,"B",5.25,18,12.5,16.5,11.25,1.5,7.75,21,12,9.25,"Angry Neighbors",7,null,null,"Berry, Eric KCC S",null,null,null,null,null,null,null,null,null,null,null,null,null,"",null,"",null,"",null,"",null,"",null,""]
[111,111,"Bess, Davone MIA WR",159.05000000000001,12.234999999999999,10.75,8.7799999999999994,15.52,21.65,7.4,11.7,"B",7.8,14.2,10.3,18.5,21.65,2.5499999999999998,8.25,null,null,null,"Free Agent",7,null,null,"Bess, Davone MIA WR",null,null,null,null,null,null,null,null,null,null,null,null,null,"",null,"",null,"",null,"",null,"",null,""]
[112,112,"Bethea, Antoine IND S",163.55000000000001,10.222,18.5,14,2.5,"B",7.5,9,10.5,9.75,6.75,16.600000000000001,9,8.25,13.25,7.25,14.2,7.5,9,"Free Agent",4,null,null,"Bethea, Antoine IND S",null,null,null,null,null,null,null,null,null,null,null,null,null,"",null,"",null,"",null,"",null,"",null,""]
[113,113,"Bethel, Justin ARI S",1.5,9.4E-2,0,0,0,0,0,0,0,0,0,"B",0,0,0,1.5,0,0,0,"Free Agent",10,null,null,"Bethel, Justin ARI S",null,null,null,null,null,null,null,null,null,null,null,null,null,"",null,"",null,"",null,"",null,"",null,""]
[114,114,"Biermann, Kroy ATL DE",123.85,7.7409999999999997,5,10,2.5,3.75,18.850000000000001,6.25,"B",21.7,3.75,6,6.25,11.1,5,8.75,8.6999999999999993,1.25,5,"Free Agent",7,null,null,"Biermann, Kroy ATL DE",null,null,null,null,null,null,null,null,null,null,null,null,null,"",null,"",null,"",null,"",null,"",null,""]
[115,115,"Bigby, Atari SDC S",89.5,8.1359999999999992,13.75,4.5,19.5,9.25,3,8.25,"B",11.5,6.75,3,7,3,null,null,null,null,null,"Free Agent",7,null,null,"Bigby, Atari SDC S",null,null,null,null,null,null,null,null,null,null,null,null,null,"",null,"",null,"",null,"",null,"",null,""]
[116,116,"Biggers, E.J. TBB CB",101.55,7.8120000000000003,null,null,null,4,"B",5.5,10,6,15,5.25,2.25,19.8,6.75,13.25,3,1.5,9.25,"Free Agent",5,null,null,"Biggers, E.J. TBB CB",null,null,null,null,null,null,null,null,null,null,null,null,null,"",null,"",null,"",null,"",null,"",null,""]
[117,117,"Bilukidi, Christo OAK DT",18.75,1.4419999999999999,0,0,null,0,"B",null,0,0,null,6.25,0,1.25,5,5,0,1.25,0,"Free Agent",5,null,null,"Bilukidi, Christo OAK DT",null,null,null,null,null,null,null,null,null,null,null,null,null,"",null,"",null,"",null,"",null,"",null,""]
[118,118,"Binns, Armon MIA WR",61.7,6.17,7.8,12.85,17.05,0,6.1,3.7,"B",null,0,null,null,null,null,null,0,6.45,7.75,"Free Agent (I)",7,null,null,"Binns, Armon MIA WR",null,null,null,null,null,null,null,null,null,null,null,null,null,"",null,"",null,"",null,"",null,"",null,""]
[119,119,"Bird, Bront SDC LB",30.25,6.05,null,null,null,null,null,null,"B",null,null,null,null,null,0,14.25,7,0,9,"Free Agent",7,null,null,"Bird, Bront SDC LB",null,null,null,null,null,null,null,null,null,null,null,null,null,"",null,"",null,"",null,"",null,"",null,""]
[120,120,"Bironas, Rob TEN PK",111,6.9379999999999997,7,4,13,2,1,15,5,6,4,14.5,"B",12.5,4,11.5,2,1,8.5,"Free Agent (P)",11,null,null,"Bironas, Rob TEN PK",null,null,null,null,null,null,null,null,null,null,null,null,null,"",null,"",null,{"$f":"IF(ISNUMBER(SEARCH(\"*Total Starters:*\",BA131)),BB131,\"\")","v":""},null,"",null,"",null,""]
[121,121,"Black, Ahmad TBB S",72.52,4.532,7.5,1.5,0,2.25,"B",0,0,3,20.77,3.75,5.25,1.5,11.5,9,2.5,0.75,3.25,"Free Agent",5,null,null,"Black, Ahmad TBB S",null,null,null,null,null,null,null,null,null,null,null,null,null,{"$f":"IF(ISNUMBER(SEARCH(\"*Minimum Auction Opening Bid:*\",BA132)),BB132,\"\")","v":""},null,{"$f":"IF(ISNUMBER(SEARCH(\"*All Auction Bids Must Be In Increments Of:*\",BA132)),BB132,\"\")","v":""},null,"",null,{"$f":"IF(ISNUMBER(SEARCH(\"Number of Roster Spots:*\",BA132)),BB132,\"\")","v":""},null,{"$f":"IF(ISNUMBER(SEARCH(\"Number of Roster Spots:*\",BA132)),BB132,\"\")","v":""},null,{"$f":"IF(ISNUMBER(SEARCH(\"*Starting Auction Funds Available To Each Franchise:*\",BA132)),BB132,\"\")","v":""}]
[122,122,"Black, Quincy TBB LB",47.75,5.306,7,6.75,0,2.25,"B",7.5,0.75,5.5,7.5,10.5,null,null,null,null,null,null,null,"Free Agent",5,null,null,"Black, Quincy TBB LB",null,null,null,null,null,null,null,null,null,null,null,null,null,"",null,"",null,"",null,"",null,"",null,""]
[123,123,"Blackburn, Chase NYG LB",171.15,11.41,8.25,12.7,1.5,25.9,12.75,6.5,18,6.75,null,9.75,"B",16.8,9.75,9.75,12,7.5,13.25,"Free Agent",11,null,null,"Blackburn, Chase NYG LB",null,null,null,null,null,null,null,null,null,null,null,null,null,"",null,"",null,"",null,"",null,"",null,""]
[124,124,"Blackmon, Justin JAC WR",207.88,12.993,8.15,0,1.95,12.3,7.75,"B",1.95,11.7,15.45,6.25,47.43,19.649999999999999,2.15,13.2,16.8,22.65,20.5,"Derek's Daycare (S)",6,null,null,"Blackmon, Justin JAC WR",null,null,null,null,null,null,null,null,null,null,null,null,null,"",null,"",null,"",null,"",null,"",null,""]
[125,125,"Blake, Antwon JAC S",2.5,0.156,0,0,0,0,0,"B",0,0,0,0,0,0,2.5,0,0,0,0,"Free Agent",6,null,null,"Blake, Antwon JAC S",null,null,null,null,null,null,null,null,null,null,null,null,null,"",null,"",null,"",null,"",null,"",null,""]
[126,126,"Blanton, Robert MIN S",7.25,0.60399999999999998,null,null,null,0,7.25,0,0,0,0,0,"B",0,0,0,0,0,null,"Free Agent",11,null,null,"Blanton, Robert MIN S",null,null,null,null,null,null,null,null,null,null,null,null,null,"",null,"",null,"",null,"",null,"",null,""]
[127,127,"Blount, LeGarrette TBB RB",28.3,2.177,2,0,1.9,7.7,"B",11.8,-0.2,1.6,0.5,0.3,null,0,null,0.2,2.5,0,null,"Free Agent",5,null,null,"Blount, LeGarrette TBB RB",null,null,null,null,null,null,null,null,null,null,null,null,null,"",null,"",null,"",null,"",null,"",null,""]
[128,128,"Bolden, Brandon NEP RB",45.24,4.524,1.1000000000000001,0,6.4,24.54,6.4,2.8,null,null,"B",null,null,null,null,1.1000000000000001,0,0.3,2.6,"Free Agent",9,null,null,"Bolden, Brandon NEP RB",null,null,null,null,null,null,null,null,null,null,null,null,null,"",null,"",null,"",null,"",null,"",null,""]
[129,129,"Bolden, Omar DEN CB",19.3,1.206,0,1.88,2.64,0.64,2.44,2.72,"B",0.48,0,2.5,0,0,0,0,1.5,4.5,0,"Free Agent",7,null,null,{"$f":"IF(ISBLANK(C139),\"\",C139)","v":"Bolden, Omar DEN CB"},null,null,null,null,null,null,null,null,null,null,null,null,null,"",null,"",null,"",null,"",null,"",null,""]
[130,130,"Boldin, Anquan BAL WR",201.65,13.443,18.600000000000001,3.2,9.8000000000000007,24.35,14.2,16.05,6.15,"B",13.95,8.8000000000000007,17.899999999999999,6.7,20.350000000000001,23.55,0,18.05,null,"Hurry Up and Happy Birthday, Donny",8,null,null,"Boldin, Anquan BAL WR",null,null,null,null,null,null,null,null,null,null,null,null,null,"",null,"",null,"",null,"",null,"",null,""]
[131,131,"Boley, Michael NYG LB",167.25,10.452999999999999,14.1,12.6,21.05,8.5,10.75,9,13.75,9.75,21.25,8.5,"B",8.25,6.75,13.25,2.25,6,1.5,"Free Agent",11,null,null,"Boley, Michael NYG LB",null,null,null,null,null,null,null,null,null,null,null,null,null,"",null,"",null,"",null,"",null,"",null,""]
[132,132,"Boss, Kevin KCC TE",17,8.5,12.6,4.4000000000000004,null,null,null,null,"B",null,null,null,null,null,null,null,null,null,null,"Free Agent",7,null,null,"Boss, Kevin KCC TE",null,null,null,null,null,null,null,null,null,null,null,null,null,"",null,"",null,"",null,"",null,"",null,""]
[133,133,"Bosworth, Kyle JAC LB",48,3,3.25,6.5,7.25,10.75,6.75,"B",1.5,1.5,0,0,7.5,0,0,0,0,3,0,"Free Agent",6,null,null,"Bosworth, Kyle JAC LB",null,null,null,null,null,null,null,null,null,null,null,null,null,"",null,"",null,"",null,"",null,"",null,""]
[134,134,"Bowe, Dwayne KCC WR",170.85,13.141999999999999,9.0500000000000007,32.200000000000003,16.649999999999999,25.55,13.5,6.25,"B",11.25,14.9,10.5,0,9.1,11.4,10.5,null,null,null,"Derek's Daycare (P)",7,null,null,"Bowe, Dwayne KCC WR",null,null,null,null,null,null,null,null,null,null,null,null,null,"",null,"",null,"",null,"",null,"",null,""]
[135,135,"Bowen, Stephen WAS DE",64.2,4.0119999999999996,7.5,6,0,0,5,13.15,2.5,5,8,"B",0,7.05,6.25,0,0,0,3.75,"Free Agent",10,null,null,"Bowen, Stephen WAS DE",null,null,null,null,null,null,null,null,null,null,null,null,null,"",null,"",null,"",null,"",null,"",null,""]
[136,136,"Bowers, Da'Quan TBB DE",51.55,5.1550000000000002,null,null,null,null,"B",null,null,0,12.4,0,12,0,9.75,0,9.4,1.25,6.75,"Free Agent",5,null,null,"Bowers, Da'Quan TBB DE",null,null,null,null,null,null,null,null,null,null,null,null,null,"",null,"",null,"",null,"",null,"",null,""]
[137,137,"Bowman, Navorro SFO LB",219.25,13.702999999999999,25.35,13.75,18.75,10,8.75,12.25,16.5,8.4,"B",17.75,17.25,6.75,11.25,10.5,18.25,16,7.75,"Roddy White Man Can't Jump",9,null,null,"Bowman, Navorro SFO LB",null,null,null,null,null,null,null,null,null,null,null,null,null,"",null,"",null,"",null,"",null,"",null,""]
[138,138,"Bowman, Zackary CHI CB",19,1.7270000000000001,null,null,null,null,null,"B",2.5,0,4,0,0,4,0,0,0,8.5,0,"Free Agent",6,null,null,"Bowman, Zackary CHI CB",null,null,null,null,null,null,null,null,null,null,null,null,null,"",null,"",null,"",null,"",null,"",null,""]
[139,139,"Boykin, Brandon PHI CB",102.25,6.391,6.59,4.42,7.14,10.5,8.6,10.88,"B",8.5299999999999994,2.02,3.76,0,6.9,4.0999999999999996,3.7,7.7,11.8,5.61,"Free Agent",7,null,null,"Boykin, Brandon PHI CB",null,null,null,null,null,null,null,null,null,null,null,null,null,"",null,"",null,"",null,"",null,"",null,""]
[140,140,"Boykin, Jarrett GBP WR",8.9499999999999993,0.89500000000000002,null,null,null,null,null,0,0,2.15,3.2,"B",null,0,0,1.65,0,0,1.95,"Free Agent",10,null,null,"Boykin, Jarrett GBP WR",null,null,null,null,null,null,null,null,null,null,null,null,null,"",null,"",null,"",null,"",null,"",null,""]
[141,141,"Brace, Ron FA DT",8.5,0.85,0,7.25,0,0,1.25,0,null,0,null,null,0,0,0,null,null,null,null,"Free Agent","-",null,null,"Brace, Ron FA DT",null,null,null,null,null,null,null,null,null,null,null,null,null,"",null,"",null,"",null,"",null,"",null,""]
[142,142,"Bradford, Allen SEA LB",0,0,null,null,null,null,null,null,null,null,null,null,"B",null,null,null,null,null,0,"Free Agent",11,null,null,"Bradford, Allen SEA LB",null,null,null,null,null,null,null,null,null,null,null,null,null,"",null,"",null,"",null,"",null,"",null,""]
[143,143,"Bradford, Sam STL QB",217.7,13.606,8.1199999999999992,26.5,-4.5199999999999996,4.6399999999999997,13.64,25.15,10.199999999999999,9.5,"B",17.899999999999999,10.5,13.3,11.94,12.66,29.75,15.74,12.68,"Derek's Daycare ",9,null,null,"Bradford, Sam STL QB",null,null,null,null,null,null,null,null,null,null,null,null,null,"",null,"",null,"",null,"",null,"",null,""]
[144,144,"Bradham, Nigel BUF LB",65.25,4.0780000000000003,0,0.75,2.25,0,9,3.75,5.25,"B",8.5,0,4.75,5.25,2.25,1.5,4.5,2.5,15,"Free Agent",8,null,null,"Bradham, Nigel BUF LB",null,null,null,null,null,null,null,null,null,null,null,null,null,"",null,"",null,"",null,"",null,"",null,""]
[145,145,"Bradley, Stewart ARI LB",10.5,0.65600000000000003,0,0,0,0,0,0,0.75,0,0,"B",0,0,0,0,1.5,0,8.25,"Free Agent",10,null,null,"Bradley, Stewart ARI LB",null,null,null,null,null,null,null,null,null,null,null,null,null,"",null,"",null,"",null,"",null,"",null,""]
[146,146,"Bradshaw, Ahmad NYG RB",182,13,17.3,1.6,null,10.7,33.9,19,16.5,4.8,4.8,7.1,"B",20.9,13.6,3.3,null,5.7,22.8,"I like my Women like I like my coffee, _______. (Q)",11,null,null,"Bradshaw, Ahmad NYG RB",null,null,null,null,null,null,null,null,null,null,null,null,null,"",null,"",null,"",null,"",null,"",null,""]
[147,147,"Brady, Tom NEP QB",378.28,23.643000000000001,18.54,13.7,21.15,38.4,14.72,23.75,19.36,35.5,"B",18.38,31.55,39.65,7.42,32.44,31.68,11.68,20.36,"BELAC (P)",9,null,null,"Brady, Tom NEP QB",null,null,null,null,null,null,null,null,null,null,null,null,null,"",null,"",null,"",null,"",null,"",null,""]
[148,148,"Braman, Bryan HOU LB",10,0.71399999999999997,null,null,0,1.5,0,4.25,1.5,"B",0,0,0,0,0,0.75,2,0,0,"Free Agent",8,null,null,"Braman, Bryan HOU LB",null,null,null,null,null,null,null,null,null,null,null,null,null,"",null,"",null,"",null,"",null,"",null,""]
[149,149,"Branch, Alan SEA DT",71.900000000000006,4.4939999999999998,5,3.75,0,11.4,6.25,2.5,0,3.75,3,5,"B",5,10,5,5,1.25,5,"Free Agent",11,null,null,"Branch, Alan SEA DT",null,null,null,null,null,null,null,null,null,null,null,null,null,"",null,"",null,"",null,"",null,"",null,""]
[150,150,"Branch, Andre JAC DE",39.200000000000003,3.0150000000000001,2.5,11.25,0,2.5,0,"B",2.5,14.2,0,5,0,0,1.25,0,null,null,null,"Free Agent",6,null,null,"Branch, Andre JAC DE",null,null,null,null,null,null,null,null,null,null,null,null,null,"",null,"",null,"",null,"",null,"",null,""]
[151,151,"Branch, Deion NEP WR",34.5,3.45,null,null,3.6,0,3.75,1.75,2.15,0,"B",8,null,null,null,null,8.6999999999999993,3.7,2.85,"Free Agent",9,null,null,"Branch, Deion NEP WR",null,null,null,null,null,null,null,null,null,null,null,null,null,"",null,"",null,"",null,"",null,"",null,""]
[152,152,"Branch, Tyvon OAK S",141.6,10.114000000000001,7.5,10.5,11.25,12.75,"B",14.6,8.25,8.5,18.5,10.75,null,6.75,15,8.25,6,3,null,"Rancho Cucamonga Ghosts",5,null,null,"Branch, Tyvon OAK S",null,null,null,null,null,null,null,null,null,null,null,null,null,"",null,"",null,"",null,"",null,"",null,""]
[153,153,"Brazill, LaVon IND WR",39.15,2.61,0.65,null,0,"B",0,4.05,0,2.15,5,3.35,7.1,2.35,12.45,2.0499999999999998,0,0,0,"Free Agent (S)",4,null,null,"Brazill, LaVon IND WR",null,null,null,null,null,null,null,null,null,null,null,null,null,"",null,"",null,"",null,"",null,"",null,""]
[154,154,"Breaston, Steve KCC WR",15.55,1.5549999999999999,5.5,-0.6,1.45,2.4500000000000002,0,0,"B",0,4.2,null,2.5499999999999998,null,null,null,null,null,0,"Free Agent",7,null,null,"Breaston, Steve KCC WR",null,null,null,null,null,null,null,null,null,null,null,null,null,"",null,"",null,"",null,"",null,"",null,""]
[155,155,"Brees, Drew NOS QB",399.51,24.969000000000001,23.95,20.25,17.5,40.76,34.299999999999997,"B",37.950000000000003,14.72,13.46,23.82,23.76,15.48,1.05,17.600000000000001,35.450000000000003,43.66,35.799999999999997,"I like my Women like I like my coffee, _______.",6,null,null,"Brees, Drew NOS QB",null,null,null,null,null,null,null,null,null,null,null,null,null,"",null,"",null,"",null,"",null,"",null,""]
[156,156,"Brent, Josh DAL DT",59.45,4.9539999999999997,3,3.75,2.5,16.600000000000001,"B",0,2.5,2.5,6.85,1.25,3.75,8.75,8,null,null,null,null,"Free Agent",5,null,null,"Brent, Josh DAL DT",null,null,null,null,null,null,null,null,null,null,null,null,null,"",null,"",null,"",null,"",null,"",null,""]
[157,157,"Briggs, Lance CHI LB",213.05,13.316000000000001,3,15.25,16.5,33.9,29.7,"B",13.75,9,4.5,5.25,11.2,14,8.5,13.75,10.5,10.75,13.5,"I like my Women like I like my coffee, _______.",6,null,null,"Briggs, Lance CHI LB",null,null,null,null,null,null,null,null,null,null,null,null,null,"",null,"",null,"",null,"",null,"",null,""]
[158,158,"Brinkley, Curtis SDC RB",34.64,3.464,7,9.6,3.7,null,null,0.44,"B",null,0.96,2.04,0,null,null,null,9.6,0.3,1,"Free Agent",7,null,null,"Brinkley, Curtis SDC RB",null,null,null,null,null,null,null,null,null,null,null,null,null,"",null,"",null,"",null,"",null,"",null,""]
[159,159,"Brinkley, Jasper MIN LB",138.75,8.6720000000000006,7.5,2.25,5.25,11.25,11.5,6,8.25,6.75,14.75,5.5,"B",16,11.5,18.75,4.5,7.5,1.5,"Free Agent (P)",11,null,null,"Brinkley, Jasper MIN LB",null,null,null,null,null,null,null,null,null,null,null,null,null,"",null,"",null,"",null,"",null,"",null,""]
[160,160,"Briscoe, Dezmon WAS WR",4.8,0.8,null,0,0,0,null,0,null,2.65,2.15,"B",null,null,null,null,null,null,null,"Free Agent",10,null,null,"Briscoe, Dezmon WAS WR",null,null,null,null,null,null,null,null,null,null,null,null,null,"",null,"",null,"",null,"",null,"",null,""]
[161,161,"Britt, Kenny TEN WR",138.94999999999999,9.9250000000000007,null,1.75,13,null,4.8,15.2,8,7.15,11.95,6.1,"B",13.05,12.5,26.3,1.95,12.6,4.5999999999999996,"Angry Neighbors (P)",11,null,null,"Britt, Kenny TEN WR",null,null,null,null,null,null,null,null,null,null,null,null,null,"",null,"",null,"",null,"",null,"",null,""]
[162,162,"Brock, Tramaine SFO CB",7,0.438,0,0,0,0,1.5,0,0,0,"B",3,0,0,0,0,0,0,2.5,"Free Agent (Q)",9,null,null,"Brock, Tramaine SFO CB",null,null,null,null,null,null,null,null,null,null,null,null,null,"",null,"",null,"",null,"",null,"",null,""]
[163,163,"Brockel, Richie CAR TE",0,0,0,0,0,0,0,"B",0,0,0,0,0,0,0,0,0,0,0,"Free Agent",6,null,null,"Brockel, Richie CAR TE",null,null,null,null,null,null,null,null,null,null,null,null,null,"",null,"",null,"",null,"",null,"",null,""]
[164,164,"Brockers, Michael STL DT",100.55,7.7350000000000003,null,null,null,0,2.5,0,18.399999999999999,0,"B",19.8,8.5,6.25,8.5,27.35,2.5,2.5,4.25,"Rancho Cucamonga Ghosts",9,null,null,"Brockers, Michael STL DT",null,null,null,null,null,null,null,null,null,null,null,null,null,"",null,"",null,"",null,"",null,"",null,""]
[165,165,"Brooking, Keith DEN LB",75.05,4.6909999999999998,1.5,7.5,2.25,6,5.25,6.75,"B",3.75,3.75,6.75,1.5,1.5,3,4.5,4.5,6.75,9.8000000000000007,"Free Agent",7,null,null,"Brooking, Keith DEN LB",null,null,null,null,null,null,null,null,null,null,null,null,null,"",null,"",null,"",null,"",null,"",null,""]
[166,166,"Brooks, Ahmad SFO LB",147.4,9.2129999999999992,9.6999999999999993,2.5,13.75,8.85,11.1,2.25,2.25,9.5,"B",23,1.5,35.35,7,4.75,0.75,2.75,12.4,"Free Agent",9,null,null,"Brooks, Ahmad SFO LB",null,null,null,null,null,null,null,null,null,null,null,null,null,"",null,"",null,"",null,"",null,"",null,""]
[167,167,"Brooks, Ron BUF CB",28.75,3.194,null,null,null,null,null,null,null,"B",0,0,0,0,20.25,4,3,0,1.5,"Free Agent (P)",8,null,null,"Brooks, Ron BUF CB",null,null,null,null,null,null,null,null,null,null,null,null,null,"",null,"",null,"",null,"",null,"",null,""]
[168,168,"Brown, Andre NYG RB",111.88,11.188000000000001,1.1599999999999999,20.100000000000001,28,2.8,0.52,null,10.4,8.1,8,20.399999999999999,"B",12.4,null,null,null,null,null,"Hurry Up and Happy Birthday, Donny",11,null,null,"Brown, Andre NYG RB",null,null,null,null,null,null,null,null,null,null,null,null,null,"",null,"",null,"",null,"",null,"",null,""]
[169,169,"Brown, Antonio PIT WR",196.82,15.14,14.33,18.22,19.920000000000002,"B",17.82,7.67,20.32,10.47,4.4000000000000004,null,null,null,13.05,14.5,22,23.35,10.77,"Invictus",4,null,null,"Brown, Antonio PIT WR",null,null,null,null,null,null,null,null,null,null,null,null,null,"",null,"",null,"",null,"",null,"",null,""]
[170,170,"Brown, Bryce PHI RB",105.18,6.5739999999999998,0.3,0.7,4.5999999999999996,0.5,0.4,0.4,"B",0.5,5.9,0.1,6.14,33.46,34.68,3.2,5.5,4.76,4.04,"Hurry Up and Happy Birthday, Donny (P)",7,null,null,"Brown, Bryce PHI RB",null,null,null,null,null,null,null,null,null,null,null,null,null,"",null,"",null,"",null,"",null,"",null,""]
[171,171,"Brown, Chykie BAL CB",35.5,2.2189999999999999,0,0,0,0,0,2.5,0,"B",0,3,1.5,2.25,4.5,0,1.5,14,6.25,"Free Agent",8,null,null,"Brown, Chykie BAL CB",null,null,null,null,null,null,null,null,null,null,null,null,null,"",null,"",null,"",null,"",null,"",null,""]
[172,172,"Brown, Curtis PIT CB",19.25,1.2829999999999999,0,0,0,"B",0,0,3,0,0,0,0,0,4,6.75,1.5,4,null,"Free Agent",4,null,null,"Brown, Curtis PIT CB",null,null,null,null,null,null,null,null,null,null,null,null,null,"",null,"",null,"",null,"",null,"",null,""]
[173,173,"Brown, Donald IND RB",68,6.8,10.8,4.5,11.1,"B",13.2,null,null,8,1.7,4.2,4.3,5.9,4.3,null,null,null,null,"Free Agent",4,null,null,"Brown, Donald IND RB",null,null,null,null,null,null,null,null,null,null,null,null,null,"",null,"",null,"",null,"",null,"",null,""]
[174,174,"Brown, Jalil KCC CB",38,2.5329999999999999,0,0,0,1.5,null,0,"B",0,3,7,1.5,7.5,0,3,8.5,1.5,4.5,"Free Agent",7,null,null,"Brown, Jalil KCC CB",null,null,null,null,null,null,null,null,null,null,null,null,null,"",null,"",null,"",null,"",null,"",null,""]
[175,175,"Brown, Josh CIN PK",44,11,null,null,null,null,null,null,null,"B",null,null,null,null,null,14.5,10,8,11.5,"Free Agent",8,null,null,"Brown, Josh CIN PK",null,null,null,null,null,null,null,null,null,null,null,null,null,"",null,"",null,"",null,"",null,"",null,""]
[176,176,"Brown, Mike JAC WR",0,0,null,null,null,null,null,"B",null,null,null,null,null,null,null,null,null,0,0,"Free Agent",6,null,null,"Brown, Mike JAC WR",null,null,null,null,null,null,null,null,null,null,null,null,null,"",null,"",null,"",null,"",null,"",null,""]
[177,177,"Brown, Omar BAL S",10.65,3.55,null,null,null,null,null,null,null,"B",null,null,null,null,null,null,0,8.4,2.25,"Free Agent",8,null,null,"Brown, Omar BAL S",null,null,null,null,null,null,null,null,null,null,null,null,null,"",null,"",null,"",null,"",null,"",null,""]
[178,178,"Brown, Ronnie SDC RB",109.1,7.7930000000000001,8.1,7.4,null,8,12.4,7.6,"B",17.2,12.3,5.4,3.5,7.9,6.7,3.4,null,5.9,3.3,"Free Agent",7,null,null,"Brown, Ronnie SDC RB",null,null,null,null,null,null,null,null,null,null,null,null,null,"",null,"",null,"",null,"",null,"",null,""]
[179,179,"Brown, Sammy STL LB",0,0,null,null,null,null,null,null,null,null,"B",null,null,null,0,null,null,null,null,"Free Agent",9,null,null,"Brown, Sammy STL LB",null,null,null,null,null,null,null,null,null,null,null,null,null,"",null,"",null,"",null,"",null,"",null,""]
[180,180,"Brown, Sergio IND S",5.5,0.34399999999999997,0,0,1.5,"B",4,0,0,0,0,0,0,0,0,0,0,0,0,"Free Agent",4,null,null,"Brown, Sergio IND S",null,null,null,null,null,null,null,null,null,null,null,null,null,"",null,"",null,"",null,"",null,"",null,""]
[181,181,"Brown, Sheldon CLE CB",153.1,10.207000000000001,3.75,0,11.5,5.25,11,23.4,27.35,3,4,"B",16,13.1,22.5,2.5,8.25,1.5,null,"Free Agent",10,null,null,"Brown, Sheldon CLE CB",null,null,null,null,null,null,null,null,null,null,null,null,null,"",null,"",null,"",null,"",null,"",null,""]
[182,182,"Brown, Stevie NYG S",202.7,12.669,0,0,11.9,10.75,18.350000000000001,4.5,20.6,30.2,13,4,"B",3.75,9,38.35,10.5,4,23.8,"I like my Women like I like my coffee, _______.",11,null,null,"Brown, Stevie NYG S",null,null,null,null,null,null,null,null,null,null,null,null,null,"",null,"",null,"",null,"",null,"",null,""]
[183,183,"Brown, Tarell SFO CB",124.95,7.8090000000000002,11.5,6,4.5,0,3,12.5,5.25,14,"B",7,11.75,7.75,7,3,11.25,5.5,14.95,"Free Agent",9,null,null,"Brown, Tarell SFO CB",null,null,null,null,null,null,null,null,null,null,null,null,null,"",null,"",null,"",null,"",null,"",null,""]
[184,184,"Brown, Zach TEN LB",222.9,13.930999999999999,4,21.5,4.5,6.75,10,7.75,3.75,6,17.25,18.2,"B",23.1,6.75,4.5,25.15,12.75,50.95,"Invictus",11,null,null,"Brown, Zach TEN LB",null,null,null,null,null,null,null,null,null,null,null,null,null,"",null,"",null,{"$f":"IF(ISNUMBER(SEARCH(\"*Total Starters:*\",BA195)),BB195,\"\")","v":""},null,"",null,"",null,""]
[185,185,"Browner, Brandon SEA CB",105.58,8.798,4.43,20,6.25,0,14,11.5,10.9,7,15.75,2.25,"B",1.5,12,null,null,null,null,"Free Agent",11,null,null,"Browner, Brandon SEA CB",null,null,null,null,null,null,null,null,null,null,null,null,null,{"$f":"IF(ISNUMBER(SEARCH(\"*Minimum Auction Opening Bid:*\",BA196)),BB196,\"\")","v":""},null,{"$f":"IF(ISNUMBER(SEARCH(\"*All Auction Bids Must Be In Increments Of:*\",BA196)),BB196,\"\")","v":""},null,"",null,{"$f":"IF(ISNUMBER(SEARCH(\"Number of Roster Spots:*\",BA196)),BB196,\"\")","v":""},null,{"$f":"IF(ISNUMBER(SEARCH(\"Number of Roster Spots:*\",BA196)),BB196,\"\")","v":""},null,{"$f":"IF(ISNUMBER(SEARCH(\"*Starting Auction Funds Available To Each Franchise:*\",BA196)),BB196,\"\")","v":""}]
[186,186,"Broyles, Ryan DET WR",71.5,7.15,null,null,0,0,"B",0,14.85,13.45,12.7,1.85,6,21.1,1.55,null,null,null,null,"The Black Champion (Q)",5,null,null,"Broyles, Ryan DET WR",null,null,null,null,null,null,null,null,null,null,null,null,null,"",null,"",null,"",null,"",null,"",null,""]
[187,187,"Bruton, David DEN S",10.3,0.64400000000000002,0,0,0,1.5,0,0,"B",0,0,0,1.5,7.3,0,0,0,0,0,"Free Agent",7,null,null,"Bruton, David DEN S",null,null,null,null,null,null,null,null,null,null,null,null,null,"",null,"",null,"",null,"",null,"",null,""]
[188,188,"Bryant, Desmond OAK DE",108.7,6.7939999999999996,0,5,10.25,5,"B",0,4.75,2.5,4.25,14.5,11.25,1.25,4.5,17.5,11.6,8.15,8.1999999999999993,"Free Agent",5,null,null,"Bryant, Desmond OAK DE",null,null,null,null,null,null,null,null,null,null,null,null,null,"",null,"",null,"",null,"",null,"",null,""]
[189,189,"Bryant, Dez DAL WR",330.82,20.675999999999998,13.5,0.57999999999999996,16.57,22.5,"B",38.42,5.03,12.85,2.75,19.45,35.5,35.1,29.3,14.9,16.899999999999999,55.37,12.1,"I like my Women like I like my coffee, _______.",5,null,null,"Bryant, Dez DAL WR",null,null,null,null,null,null,null,null,null,null,null,null,null,"",null,"",null,"",null,"",null,"",null,""]
[190,190,"Bryant, Matt ATL PK",148,9.25,16.5,9.5,3,13,7.5,12,"B",12.5,12,9,13,3,13,2,10,7,5,"Free Agent",7,null,null,"Bryant, Matt ATL PK",null,null,null,null,null,null,null,null,null,null,null,null,null,"",null,"",null,"",null,"",null,"",null,""]
[191,191,"Bryant, Red SEA DE",58.5,3.6560000000000001,8,5,6.25,2.5,0,2.5,6,2.5,3.75,7.5,"B",0,3.75,0,0,3.25,7.5,"Free Agent",11,null,null,"Bryant, Red SEA DE",null,null,null,null,null,null,null,null,null,null,null,null,null,"",null,"",null,"",null,"",null,"",null,""]
[192,192,"Bunkley, Brodrick NOS DT",62.55,4.17,11.95,2.5,3.75,0,3.75,"B",0,null,8.8000000000000007,4.25,3.75,1.25,5,0,1.25,0,16.3,"Free Agent",6,null,null,"Bunkley, Brodrick NOS DT",null,null,null,null,null,null,null,null,null,null,null,null,null,"",null,"",null,"",null,"",null,"",null,""]
[193,193,"Burfict, Vontaze CIN LB",170.1,10.631,0,3,6,21.6,10,11.25,22,"B",5.25,9,8.5,10.25,9.75,12,11,9.5,21,"Angry Neighbors",8,null,null,{"$f":"IF(ISBLANK(C203),\"\",C203)","v":"Burfict, Vontaze CIN LB"},null,null,null,null,null,null,null,null,null,null,null,null,null,"",null,"",null,"",null,"",null,"",null,""]
[194,194,"Burleson, Nate DET WR",76.55,12.757999999999999,15,2.85,28.1,12.15,"B",15.6,2.85,null,null,null,null,null,null,null,null,null,null,"Free Agent (P)",5,null,null,"Burleson, Nate DET WR",null,null,null,null,null,null,null,null,null,null,null,null,null,"",null,"",null,"",null,"",null,"",null,""]
[195,195,"Burnett, Kevin MIA LB",171.75,10.734,8.5,6,13.5,12,11.55,8.75,"B",17.25,7.5,8.25,9.75,8.25,16.75,3,17.45,12,11.25,"Free Agent",7,null,null,"Burnett, Kevin MIA LB",null,null,null,null,null,null,null,null,null,null,null,null,null,"",null,"",null,"",null,"",null,"",null,""]
[196,196,"Burnett, Morgan GBP S",204.35,12.772,7.5,10,1.5,17.5,13.5,6.75,7.5,28.1,9.75,"B",18.899999999999999,8.75,27.85,15,13,8.25,10.5,"Hurry Up and Happy Birthday, Donny",10,null,null,"Burnett, Morgan GBP S",null,null,null,null,null,null,null,null,null,null,null,null,null,"",null,"",null,"",null,"",null,"",null,""]
[197,197,"Burress, Plaxico PIT WR",13.95,4.6500000000000004,null,null,null,"B",null,null,null,null,null,null,null,0,null,3.05,null,null,10.9,"Free Agent (I)",4,null,null,"Burress, Plaxico PIT WR",null,null,null,null,null,null,null,null,null,null,null,null,null,"",null,"",null,"",null,"",null,"",null,""]
[198,198,"Burris, Miles OAK LB",147.30000000000001,9.2059999999999995,13,5.5,6.25,0,"B",4.5,15.25,10.5,6,6,9.75,15.5,10.5,9,6.25,18.8,10.5,"Free Agent (P)",5,null,null,"Burris, Miles OAK LB",null,null,null,null,null,null,null,null,null,null,null,null,null,"",null,"",null,"",null,"",null,"",null,""]
[199,199,"Burton, Brandon MIN CB",0,0,0,null,null,0,0,null,null,null,0,null,"B",null,null,null,null,null,null,"Free Agent",11,null,null,"Burton, Brandon MIN CB",null,null,null,null,null,null,null,null,null,null,null,null,null,"",null,"",null,"",null,"",null,"",null,""]
[200,200,"Burton, Stephen MIN WR",15.75,1.3120000000000001,0,7.95,0,null,1.85,0,0,0,null,0,"B",0,0,0,5.95,null,null,"Free Agent",11,null,null,"Burton, Stephen MIN WR",null,null,null,null,null,null,null,null,null,null,null,null,null,"",null,"",null,"",null,"",null,"",null,""]
[201,201,"Bush, Jarrett GBP CB",8.5,0.53100000000000003,6,0,0,0,0,0,0,0,2.5,"B",0,0,0,0,0,0,0,"Free Agent",10,null,null,"Bush, Jarrett GBP CB",null,null,null,null,null,null,null,null,null,null,null,null,null,"",null,"",null,"",null,"",null,"",null,""]
[202,202,"Bush, Josh NYJ S",4,0.25,0,1.25,0,0,0,0,0,1.25,"B",0,0,0,0,0,0,0,1.5,"Free Agent",9,null,null,"Bush, Josh NYJ S",null,null,null,null,null,null,null,null,null,null,null,null,null,"",null,"",null,"",null,"",null,"",null,""]
[203,203,"Bush, Michael CHI RB",85.4,6.569,16.2,5.4,15.3,4.7,7.2,"B",4.3,0.5,4.3,0.4,3.7,18.899999999999999,3.9,0.6,null,null,null,"Klingon Warriors",6,null,null,"Bush, Michael CHI RB",null,null,null,null,null,null,null,null,null,null,null,null,null,"",null,"",null,"",null,"",null,"",null,""]
[204,204,"Bush, Rafael NOS S",33.75,2.109,0,0,0,0,0,"B",0,0,0,0,0,2.5,9.25,2.25,14.5,0.75,4.5,"Free Agent",6,null,null,"Bush, Rafael NOS S",null,null,null,null,null,null,null,null,null,null,null,null,null,"",null,"",null,"",null,"",null,"",null,""]
[205,205,"Bush, Reggie MIA RB",208.24,13.015000000000001,16.5,39.14,7.2,6.7,15.2,11.1,"B",4.5,14.6,0.9,5.5,15.2,6.4,15.3,11.4,31.7,6.9,"Rancho Cucamonga Ghosts",7,null,null,"Bush, Reggie MIA RB",null,null,null,null,null,null,null,null,null,null,null,null,null,"",null,"",null,"",null,"",null,"",null,""]
[206,206,"Butler, Darius IND CB",103.6,9.4179999999999993,null,null,null,"B",0,2.25,null,null,4.75,35.700000000000003,10.5,6.25,6.5,10.45,7.5,18.2,1.5,"Free Agent",4,null,null,"Butler, Darius IND CB",null,null,null,null,null,null,null,null,null,null,null,null,null,"",null,"",null,"",null,"",null,"",null,""]
[207,207,"Butler, Deon SEA WR",0,0,null,null,null,null,null,null,null,null,null,null,"B",null,null,null,null,0,null,"Free Agent",11,null,null,"Butler, Deon SEA WR",null,null,null,null,null,null,null,null,null,null,null,null,null,"",null,"",null,"",null,"",null,"",null,""]
[208,208,"Butler, Donald SDC LB",149.1,12.425000000000001,18.45,6.25,15.5,26.4,2.25,3.5,"B",13.5,17,12.25,14.25,6,null,null,null,13.75,null,"Polk High",7,null,null,"Butler, Donald SDC LB",null,null,null,null,null,null,null,null,null,null,null,null,null,"",null,"",null,"",null,"",null,"",null,""]
[209,209,"Butler, Victor DAL LB",69.75,4.359,0,4,3.75,4,"B",10,0,0,9.9,10.25,1.5,0,13.1,0,5.5,7.75,0,"Free Agent (O)",5,null,null,"Butler, Victor DAL LB",null,null,null,null,null,null,null,null,null,null,null,null,null,"",null,"",null,"",null,"",null,"",null,""]
[210,210,"Byham, Nate TBB TE",12.3,1.1180000000000001,null,null,null,null,"B",null,0,0,4.5,0,7.8,0,0,0,0,0,0,"Free Agent",5,null,null,"Byham, Nate TBB TE",null,null,null,null,null,null,null,null,null,null,null,null,null,"",null,"",null,"",null,"",null,"",null,""]
[211,211,"Bynes, Josh BAL LB",42.75,4.2750000000000004,null,null,null,null,null,null,0,"B",0,1.5,0,0,3.25,4.5,20.5,4,9,"Free Agent",8,null,null,"Bynes, Josh BAL LB",null,null,null,null,null,null,null,null,null,null,null,null,null,"",null,"",null,"",null,"",null,"",null,""]
[212,212,"Byrd, Jairus BUF S",165.35,10.334,6,15.75,4.5,19,3,25.6,10.5,"B",6.75,5.25,17,9.25,13.5,6.75,6,9,7.5,"Derek's Daycare ",8,null,null,"Byrd, Jairus BUF S",null,null,null,null,null,null,null,null,null,null,null,null,null,"",null,"",null,"",null,"",null,"",null,""]
[213,213,"Byrd, Laron ARI WR",2.0499999999999998,0.68300000000000005,null,null,null,null,null,null,null,null,null,"B",null,0,null,null,0,2.0499999999999998,null,"Free Agent (Q)",10,null,null,"Byrd, Laron ARI WR",null,null,null,null,null,null,null,null,null,null,null,null,null,"",null,"",null,"",null,"",null,"",null,""]
[214,214,"Cadet, Travaris NOS RB",34.630000000000003,2.6640000000000001,0,null,null,0,null,"B",0,0,0.7,5.53,9.42,5.92,3.76,4.92,2.5,0.72,1.1599999999999999,"Free Agent",6,null,null,"Cadet, Travaris NOS RB",null,null,null,null,null,null,null,null,null,null,null,null,null,"",null,"",null,"",null,"",null,"",null,""]
[215,215,"Caldwell, Andre DEN WR",4.45,0.55600000000000005,null,null,null,1.4,0,0,"B",0,null,0,null,null,0,3.05,null,null,0,"Free Agent",7,null,null,"Caldwell, Andre DEN WR",null,null,null,null,null,null,null,null,null,null,null,null,null,"",null,"",null,"",null,"",null,"",null,""]
[216,216,"Camarillo, Greg FA WR",9.4,1.88,null,0,0,null,9.4,null,null,null,0,0,null,null,null,null,null,null,null,"Free Agent","-",null,null,"Camarillo, Greg FA WR",null,null,null,null,null,null,null,null,null,null,null,null,null,"",null,"",null,"",null,"",null,"",null,""]
[217,217,"Cameron, Jordan CLE TE",58.6,4.1859999999999999,0,0,12,3,5.6,6.8,1.9,2.7,0,"B",0,10.199999999999999,6,2.5,7.9,null,null,"The Black Champion",10,null,null,"Cameron, Jordan CLE TE",null,null,null,null,null,null,null,null,null,null,null,null,null,"",null,"",null,"",null,"",null,"",null,""]
[218,218,"Campbell, Calais ARI DE",208.55,16.042000000000002,7,34.450000000000003,2.5,14.75,2.5,14.5,4.25,22.6,19.75,"B",null,null,null,16.25,31.25,27.35,11.4,"Rancho Cucamonga Ghosts",10,null,null,"Campbell, Calais ARI DE",null,null,null,null,null,null,null,null,null,null,null,null,null,"",null,"",null,"",null,"",null,"",null,""]
[219,219,"Campbell, D.J. CAR S",20,4,null,null,null,null,null,"B",null,null,null,null,null,null,1.5,4.5,5.5,4,4.5,"Free Agent",6,null,null,"Campbell, D.J. CAR S",null,null,null,null,null,null,null,null,null,null,null,null,null,"",null,"",null,"",null,"",null,"",null,""]
[220,220,"Campbell, Jason CHI QB",11.4,1.9,null,null,null,null,0,"B",0.5,null,-0.3,5.26,-2.42,null,null,8.36,null,null,null,"Free Agent",6,null,null,"Campbell, Jason CHI QB",null,null,null,null,null,null,null,null,null,null,null,null,null,"",null,"",null,"",null,"",null,"",null,""]
[221,221,"Campbell, Tommie TEN CB",21.83,1.5589999999999999,0,0,10.33,0,1.5,0,null,null,0,0,"B",0,0,0,0,0,10,"Free Agent",11,null,null,"Campbell, Tommie TEN CB",null,null,null,null,null,null,null,null,null,null,null,null,null,"",null,"",null,"",null,"",null,"",null,""]
[222,222,"Canty, Chris NYG DT",78.150000000000006,8.6829999999999998,null,null,null,null,null,null,10,12.2,1.25,1.25,"B",13.7,2.5,2.5,19,15.75,null,"Free Agent",11,null,null,"Canty, Chris NYG DT",null,null,null,null,null,null,null,null,null,null,null,null,null,"",null,"",null,"",null,"",null,"",null,""]
[223,223,"Carder, Tank CLE LB",3.25,0.217,0,null,0,0,0,0,0,0,0,"B",0,0,0,0,0,0,3.25,"Free Agent",10,null,null,"Carder, Tank CLE LB",null,null,null,null,null,null,null,null,null,null,null,null,null,"",null,"",null,"",null,"",null,"",null,""]
[224,224,"Carey, Don DET S",64.599999999999994,7.1779999999999999,null,null,null,null,"B",null,null,null,0,0,1.5,0,30.1,6.75,10.25,8.75,7.25,"Free Agent",5,null,null,"Carey, Don DET S",null,null,null,null,null,null,null,null,null,null,null,null,null,"",null,"",null,"",null,"",null,"",null,""]
[225,225,"Carlson, John MIN TE",16.3,1.1639999999999999,0,0,0,1.4,1.7,2.2000000000000002,0,null,null,2.6,"B",2.2000000000000002,0,0,6.2,0,0,"Free Agent",11,null,null,"Carlson, John MIN TE",null,null,null,null,null,null,null,null,null,null,null,null,null,"",null,"",null,"",null,"",null,"",null,""]
[226,226,"Carmichael, Rashad HOU CB",7.75,1.292,null,null,null,null,null,null,null,"B",null,null,null,0,7.75,0,0,0,0,"Free Agent",8,null,null,"Carmichael, Rashad HOU CB",null,null,null,null,null,null,null,null,null,null,null,null,null,"",null,"",null,"",null,"",null,"",null,""]
[227,227,"Carpenter, Bobby FA LB",0.75,0.188,null,null,null,null,0,0.75,0,0,null,null,null,null,null,null,null,null,null,"Free Agent","-",null,null,"Carpenter, Bobby FA LB",null,null,null,null,null,null,null,null,null,null,null,null,null,"",null,"",null,"",null,"",null,"",null,""]
[228,228,"Carpenter, Dan MIA PK",99,7.0709999999999997,4,5,8.5,7,5.5,5.5,"B",12.5,8,3.5,2,6.5,11,8.5,11.5,null,null,"Free Agent",7,null,null,"Carpenter, Dan MIA PK",null,null,null,null,null,null,null,null,null,null,null,null,null,"",null,"",null,"",null,"",null,"",null,""]
[229,229,"Carr, Brandon DAL CB",136.25,8.516,4,3,2.5,4.5,"B",4.5,7.5,10,5.5,24.2,10,7.5,1.5,15.7,22.1,8.25,5.5,"Free Agent",5,null,null,"Carr, Brandon DAL CB",null,null,null,null,null,null,null,null,null,null,null,null,null,"",null,"",null,"",null,"",null,"",null,""]
[230,230,"Carr, Chris SDC CB",4.8099999999999996,0.60099999999999998,null,null,null,null,null,0,"B",0.44,null,null,null,1.73,2.64,0,0,0,0,"Free Agent",7,null,null,"Carr, Chris SDC CB",null,null,null,null,null,null,null,null,null,null,null,null,null,"",null,"",null,"",null,"",null,"",null,""]
[231,231,"Carr, David NYG QB",-0.54,-0.27,null,null,-0.84,null,null,null,null,null,null,null,"B",null,null,null,null,null,0.3,"Free Agent",11,null,null,"Carr, David NYG QB",null,null,null,null,null,null,null,null,null,null,null,null,null,"",null,"",null,"",null,"",null,"",null,""]
[232,232,"Carriker, Adam WAS DE",2.5,1.25,2.5,0,null,null,null,null,null,null,null,"B",null,null,null,null,null,null,null,"Free Agent (O)",10,null,null,"Carriker, Adam WAS DE",null,null,null,null,null,null,null,null,null,null,null,null,null,"",null,"",null,"",null,"",null,"",null,""]
[233,233,"Carrington, Alex BUF DT",70.05,4.3780000000000001,0,11.5,0,6,2.5,1.75,3,"B",3.25,6,5,0,18.55,3.75,1.25,4.5,3,"Free Agent",8,null,null,"Carrington, Alex BUF DT",null,null,null,null,null,null,null,null,null,null,null,null,null,"",null,"",null,"",null,"",null,"",null,""]
[234,234,"Carroll, Nolan MIA CB",88,6.2859999999999996,0.75,5.25,1.5,9,7,9,"B",23.25,22.5,0,2.25,3,1.5,1.5,1.5,null,null,"Free Agent",7,null,null,"Carroll, Nolan MIA CB",null,null,null,null,null,null,null,null,null,null,null,null,null,"",null,"",null,"",null,"",null,"",null,""]
[235,235,"Carter, Andre OAK DE",61.4,5.117,null,null,null,null,"B",1.25,1.25,0,15.5,7.5,2.5,2.5,5,6.75,10.050000000000001,9.1,0,"Free Agent",5,null,null,"Carter, Andre OAK DE",null,null,null,null,null,null,null,null,null,null,null,null,null,"",null,"",null,"",null,"",null,"",null,""]
[236,236,"Carter, Bruce DAL LB",101.75,9.25,6.75,14,7.75,2.25,"B",6,6,7,18.75,16,6.75,10.5,null,null,null,null,null,"Polk High",5,null,null,"Carter, Bruce DAL LB",null,null,null,null,null,null,null,null,null,null,null,null,null,"",null,"",null,"",null,"",null,"",null,""]
[237,237,"Carter, Chris PIT LB",7.75,0.96899999999999997,1.5,0.75,5.5,"B",0,0,null,0,0,0,null,null,null,null,null,null,null,"Free Agent (P)",4,null,null,"Carter, Chris PIT LB",null,null,null,null,null,null,null,null,null,null,null,null,null,"",null,"",null,"",null,"",null,"",null,""]
[238,238,"Carter, David ARI DT",26.75,1.6719999999999999,0,0,0,0,2.5,0,0,0,2.5,"B",0,1.25,1.25,13,1.25,0,5,"Free Agent",10,null,null,"Carter, David ARI DT",null,null,null,null,null,null,null,null,null,null,null,null,null,"",null,"",null,"",null,"",null,"",null,""]
[239,239,"Carter, Delone IND RB",31.5,3.15,null,null,null,"B",0,1.3,4.0999999999999996,6.8,3.1,0.7,8.1,0,0,7.4,null,null,null,"Free Agent (P)",4,null,null,"Carter, Delone IND RB",null,null,null,null,null,null,null,null,null,null,null,null,null,"",null,"",null,"",null,"",null,"",null,""]
[240,240,"Carter, Quinton DEN S",0,0,0,0,0,null,null,null,"B",null,null,null,null,null,null,null,null,null,null,"Free Agent (Q)",7,null,null,"Carter, Quinton DEN S",null,null,null,null,null,null,null,null,null,null,null,null,null,"",null,"",null,"",null,"",null,"",null,""]
[241,241,"Carter, Tony DEN CB",93,6.2,0,5.5,1.5,0,0,23,"B",6.5,6.5,19.75,6.75,3,5,10,3,null,2.5,"Free Agent",7,null,null,"Carter, Tony DEN CB",null,null,null,null,null,null,null,null,null,null,null,null,null,"",null,"",null,"",null,"",null,"",null,""]
[242,242,"Casey, James HOU RB",102,6.375,3.2,6.3,5.6,17.100000000000001,11.3,5.7,0,"B",9.4,0,12.5,9.8000000000000007,8,4.5,2.4,2.1,4.0999999999999996,"Free Agent",8,null,null,"Casey, James HOU RB",null,null,null,null,null,null,null,null,null,null,null,null,null,"",null,"",null,"",null,"",null,"",null,""]
[243,243,"Casey, Jurrell TEN DT",141.80000000000001,8.8629999999999995,2.5,5,16,14.75,3.75,7.25,2.5,2.5,19.95,0,"B",17,11.75,5,3.75,12.5,17.600000000000001,"Free Agent",11,null,null,"Casey, Jurrell TEN DT",null,null,null,null,null,null,null,null,null,null,null,null,null,"",null,"",null,"",null,"",null,"",null,""]
[244,244,"Casillas, Jonathan NOS LB",40.5,2.8929999999999998,1.5,9.5,7.75,null,null,"B",3,0,6,3.75,0,0,2.75,2.5,0,3.75,0,"Free Agent",6,null,null,"Casillas, Jonathan NOS LB",null,null,null,null,null,null,null,null,null,null,null,null,null,"",null,"",null,"",null,"",null,"",null,""]
[245,245,"Cason, Antoine SDC CB",149.88999999999999,9.3680000000000003,7,8.5,20.3,16.100000000000001,14.25,9,"B",3.75,6,4.5,6.74,11.5,6,9.5,9.75,9.75,7.25,"Free Agent (P)",7,null,null,"Cason, Antoine SDC CB",null,null,null,null,null,null,null,null,null,null,null,null,null,"",null,"",null,"",null,"",null,"",null,""]
[246,246,"Cassel, Matt KCC QB",48.55,5.3940000000000001,11.32,16.55,1.1200000000000001,9.0399999999999991,-7.52,null,"B",10.02,3.94,2.36,1.72,null,null,null,null,null,null,"Free Agent",7,null,null,"Cassel, Matt KCC QB",null,null,null,null,null,null,null,null,null,null,null,null,null,"",null,"",null,"",null,"",null,"",null,""]
[247,247,"Celek, Brent PHI TE",160.04,10.669,12.5,30.84,6.6,11.7,11.4,9.3000000000000007,"B",7.7,9.1999999999999993,7.6,11.7,4.9000000000000004,17.8,1.6,null,8.4,8.8000000000000007,"I like my Women like I like my coffee, _______.",7,null,null,"Celek, Brent PHI TE",null,null,null,null,null,null,null,null,null,null,null,null,null,"",null,"",null,"",null,"",null,"",null,""]
[248,248,"Celek, Garrett SFO TE",11.1,0.85399999999999998,null,null,null,0,1.9,2.1,0,0,"B",0,0,0,0,0,0,7.1,0,"Free Agent",9,null,null,"Celek, Garrett SFO TE",null,null,null,null,null,null,null,null,null,null,null,null,null,"",null,"",null,{"$f":"IF(ISNUMBER(SEARCH(\"*Total Starters:*\",BA259)),BB259,\"\")","v":""},null,"",null,"",null,""]
[249,249,"Chancellor, Kam SEA S",139.5,8.7189999999999994,10,12,13.25,6,10.25,13.5,6,12.75,5.25,7,"B",7,9.75,6.25,3,10,7.5,"Angry Neighbors",11,null,null,"Chancellor, Kam SEA S",null,null,null,null,null,null,null,null,null,null,null,null,null,{"$f":"IF(ISNUMBER(SEARCH(\"*Minimum Auction Opening Bid:*\",BA260)),BB260,\"\")","v":""},null,{"$f":"IF(ISNUMBER(SEARCH(\"*All Auction Bids Must Be In Increments Of:*\",BA260)),BB260,\"\")","v":""},null,"",null,{"$f":"IF(ISNUMBER(SEARCH(\"Number of Roster Spots:*\",BA260)),BB260,\"\")","v":""},null,{"$f":"IF(ISNUMBER(SEARCH(\"Number of Roster Spots:*\",BA260)),BB260,\"\")","v":""},null,{"$f":"IF(ISNUMBER(SEARCH(\"*Starting Auction Funds Available To Each Franchise:*\",BA260)),BB260,\"\")","v":""}]
[250,250,"Chandler, Scott BUF TE",154.6,10.307,15.8,16.3,5.2,24.2,7,1.9,4.5,"B",9.6,20,4,5.6,8.6,14.6,13.3,4,null,"Free Agent (P)",8,null,null,"Chandler, Scott BUF TE",null,null,null,null,null,null,null,null,null,null,null,null,null,"",null,"",null,"",null,"",null,"",null,""]
[251,251,"Chaney, Jamar PHI LB",28.75,2.0539999999999998,0,0,0,3,4.5,null,"B",null,0,0,0,0,0,7,11.25,1.5,1.5,"Free Agent",7,null,null,"Chaney, Jamar PHI LB",null,null,null,null,null,null,null,null,null,null,null,null,null,"",null,"",null,"",null,"",null,"",null,""]
[252,252,"Charles, Jamaal KCC RB",268.55,16.783999999999999,9.6999999999999993,5.2,54.45,20.100000000000001,19.899999999999999,6.7,"B",4,9.6,16,15.8,9.6999999999999993,17.8,26.8,5.8,39.299999999999997,7.7,"Derek's Daycare (P)",7,null,null,"Charles, Jamaal KCC RB",null,null,null,null,null,null,null,null,null,null,null,null,null,"",null,"",null,"",null,"",null,"",null,""]
[253,253,"Charles, Orson CIN TE",22.1,1.381,0,0,4,2.5,0,2.7,0,"B",1.9,3.4,0,4.4000000000000004,0,3.2,0,0,0,"Free Agent",8,null,null,"Charles, Orson CIN TE",null,null,null,null,null,null,null,null,null,null,null,null,null,"",null,"",null,"",null,"",null,"",null,""]
[254,254,"Chekwa, Chimdi OAK CB",4.5,1.5,null,null,null,null,"B",null,null,null,null,null,null,null,null,null,0,3,1.5,"Free Agent",5,null,null,"Chekwa, Chimdi OAK CB",null,null,null,null,null,null,null,null,null,null,null,null,null,"",null,"",null,"",null,"",null,"",null,""]
[255,255,"Chick, John JAC DE",9.5,1.1879999999999999,null,null,null,null,null,"B",null,0,0,0,4.5,5,0,null,0,0,null,"Free Agent",6,null,null,"Chick, John JAC DE",null,null,null,null,null,null,null,null,null,null,null,null,null,"",null,"",null,"",null,"",null,"",null,""]
[256,256,"Choice, Tashard BUF RB",30.2,2.7450000000000001,0.3,3.7,11.9,2.5,null,0,null,"B",null,0,2.4,null,null,0,0.7,-0.3,9,"Free Agent (P)",8,null,null,"Choice, Tashard BUF RB",null,null,null,null,null,null,null,null,null,null,null,null,null,"",null,"",null,"",null,"",null,"",null,""]
[257,257,"Chung, Patrick NEP S",80.95,6.7460000000000004,4.5,6.25,7.75,10,6,4.5,null,null,"B",null,null,3,0,2.25,3,22.95,10.75,"Free Agent",9,null,null,{"$f":"IF(ISBLANK(C267),\"\",C267)","v":"Chung, Patrick NEP S"},null,null,null,null,null,null,null,null,null,null,null,null,null,"",null,"",null,"",null,"",null,"",null,""]
[258,258,"Church, Barry DAL S",8.5,2.8330000000000002,3.25,0.75,4.5,null,"B",null,null,null,null,null,null,null,null,null,null,null,null,"Free Agent",5,null,null,"Church, Barry DAL S",null,null,null,null,null,null,null,null,null,null,null,null,null,"",null,"",null,"",null,"",null,"",null,""]
[259,259,"Claiborne, Morris DAL CB",112.5,7.5,6,4.75,1.5,5.25,"B",1.5,12.25,11,7,7.5,4.5,2.25,12.25,5.25,null,22.25,9.25,"Free Agent (Q)",5,null,null,"Claiborne, Morris DAL CB",null,null,null,null,null,null,null,null,null,null,null,null,null,"",null,"",null,"",null,"",null,"",null,""]
[260,260,"Clark, Dallas TBB TE",138,8.625,4.8,9.3000000000000007,1.5,6,"B",0,18.600000000000001,8.5,5.2,7.8,22.3,12.5,12.6,3.4,16.2,9.3000000000000007,0,"Free Agent",5,null,null,"Clark, Dallas TBB TE",null,null,null,null,null,null,null,null,null,null,null,null,null,"",null,"",null,"",null,"",null,"",null,""]
[261,261,"Clark, Ryan PIT S",174.1,11.606999999999999,null,14.75,19.850000000000001,"B",11.5,16.75,9,8.75,11,18.5,10.75,11,12.75,3,10.5,4.75,11.25,"Free Agent",4,null,null,"Clark, Ryan PIT S",null,null,null,null,null,null,null,null,null,null,null,null,null,"",null,"",null,"",null,"",null,"",null,""]
[262,262,"Clay, Charles MIA TE",60.2,4.3,0,1.7,0,0,8,2.2999999999999998,"B",0,10.6,3,0,23.4,5.6,1.8,3.8,null,null,"Free Agent",7,null,null,"Clay, Charles MIA TE",null,null,null,null,null,null,null,null,null,null,null,null,null,"",null,"",null,"",null,"",null,"",null,""]
[263,263,"Clayborn, Adrian TBB DE",4.75,1.583,1.25,0,3.5,null,"B",null,null,null,null,null,null,null,null,null,null,null,null,"Free Agent (P)",5,null,null,"Clayborn, Adrian TBB DE",null,null,null,null,null,null,null,null,null,null,null,null,null,"",null,"",null,"",null,"",null,"",null,""]
[264,264,"Clayton, Keenan OAK LB",0,0,0,0,0,0,"B",0,0,0,null,0,0,0,0,0,0,0,0,"Free Agent",5,null,null,"Clayton, Keenan OAK LB",null,null,null,null,null,null,null,null,null,null,null,null,null,"",null,"",null,"",null,"",null,"",null,""]
[265,265,"Clemens, Kellen STL QB",-0.94,-0.47,null,null,null,null,null,null,null,-0.94,"B",null,null,0,null,null,null,null,null,"Free Agent",9,null,null,"Clemens, Kellen STL QB",null,null,null,null,null,null,null,null,null,null,null,null,null,"",null,"",null,"",null,"",null,"",null,""]
[266,266,"Clements, Nate CIN CB",83.6,5.5730000000000004,7,9,10.5,null,16.25,1.5,5.25,"B",7,13.35,6,0,0,2.5,0,0.75,4.5,"Free Agent",8,null,null,"Clements, Nate CIN CB",null,null,null,null,null,null,null,null,null,null,null,null,null,"",null,"",null,"",null,"",null,"",null,""]
[267,267,"Clemons, Chris MIA S",150.9,9.4309999999999992,5.25,4.5,17.5,5.5,6,12,"B",22.9,7.5,7,12.25,3.75,8.25,9.75,12.75,10,6,"Free Agent",7,null,null,"Clemons, Chris MIA S",null,null,null,null,null,null,null,null,null,null,null,null,null,"",null,"",null,"",null,"",null,"",null,""]
[268,268,"Clemons, Chris SEA DE",183.2,11.45,14.5,6.25,38.5,2.5,16.5,17.95,5,0,5,1.25,"B",19.2,0,16.899999999999999,30.9,2.5,6.25,"Free Agent (O)",11,null,null,"Clemons, Chris SEA DE",null,null,null,null,null,null,null,null,null,null,null,null,null,"",null,"",null,"",null,"",null,"",null,""]
[269,269,"Clemons, Toney JAC WR",7.85,1.9630000000000001,null,null,null,null,null,"B",null,null,null,null,null,null,null,0,0,2.95,4.9000000000000004,"Free Agent",6,null,null,"Clemons, Toney JAC WR",null,null,null,null,null,null,null,null,null,null,null,null,null,"",null,"",null,"",null,"",null,"",null,""]
[270,270,"Clutts, Tyler HOU RB",0,0,0,0,0,0,0,0,0,"B",0,0,0,0,0,0,0,0,0,"Free Agent",8,null,null,"Clutts, Tyler HOU RB",null,null,null,null,null,null,null,null,null,null,null,null,null,"",null,"",null,"",null,"",null,"",null,""]
[271,271,"Cobb, Randall GBP WR",311.63,20.774999999999999,31.2,7.96,2.87,18.87,24.27,23.92,34.72,17.329999999999998,29.02,"B",27.39,17.670000000000002,17.649999999999999,22.86,17.350000000000001,18.55,null,"Aaron Hernandez's Pistol Offense (P)",10,null,null,"Cobb, Randall GBP WR",null,null,null,null,null,null,null,null,null,null,null,null,null,"",null,"",null,"",null,"",null,"",null,""]
[272,272,"Cody, Shaun HOU DT",38.75,2.9809999999999999,5,3.75,2.5,2.5,5,2.5,1.25,"B",6.25,null,null,null,7.5,2.5,0,0,0,"Free Agent",8,null,null,"Cody, Shaun HOU DT",null,null,null,null,null,null,null,null,null,null,null,null,null,"",null,"",null,"",null,"",null,"",null,""]
[273,273,"Cody, Terrence BAL DT",49.25,3.2829999999999999,2.5,0,3.75,3.75,4.25,5,3.75,"B",2.5,6.25,null,3.75,6.25,1.25,5,1.25,0,"Free Agent (P)",8,null,null,"Cody, Terrence BAL DT",null,null,null,null,null,null,null,null,null,null,null,null,null,"",null,"",null,"",null,"",null,"",null,""]
[274,274,"Coe, Michael DAL CB",20.5,1.8640000000000001,8.5,4,null,null,"B",0,0,4,2.5,null,null,null,0,null,0,1.5,0,"Free Agent",5,null,null,"Coe, Michael DAL CB",null,null,null,null,null,null,null,null,null,null,null,null,null,"",null,"",null,"",null,"",null,"",null,""]
[275,275,"Coffman, Chase ATL TE",2.6,0.52,null,null,null,null,null,null,"B",null,null,null,0,0,0,2.6,null,null,0,"Free Agent",7,null,null,"Coffman, Chase ATL TE",null,null,null,null,null,null,null,null,null,null,null,null,null,"",null,"",null,"",null,"",null,"",null,""]
[276,276,"Cofield, Barry WAS DT",101.8,6.3620000000000001,0,0,1.25,0,17.95,5,14.65,7.5,4.75,"B",9.25,3.75,5,10.5,10.95,10,1.25,"Free Agent",10,null,null,"Cofield, Barry WAS DT",null,null,null,null,null,null,null,null,null,null,null,null,null,"",null,"",null,"",null,"",null,"",null,""]
[277,277,"Cole, Audie MIN LB",0,0,null,null,0,0,0,0,null,null,null,0,"B",null,null,null,null,null,null,"Free Agent",11,null,null,"Cole, Audie MIN LB",null,null,null,null,null,null,null,null,null,null,null,null,null,"",null,"",null,"",null,"",null,"",null,""]
[278,278,"Cole, Marquice NEP CB",32,2.286,0,0,0,0,0,0,0,7.5,"B",0.75,4.5,null,0,2.25,0,17,null,"Free Agent",9,null,null,"Cole, Marquice NEP CB",null,null,null,null,null,null,null,null,null,null,null,null,null,"",null,"",null,"",null,"",null,"",null,""]
[279,279,"Cole, Trent PHI DE",82.9,5.181,3.25,11,7.65,2.25,1.5,0,"B",2.25,7.75,3,0.75,8,4.5999999999999996,0.75,19.399999999999999,8.5,2.25,"Free Agent",7,null,null,"Cole, Trent PHI DE",null,null,null,null,null,null,null,null,null,null,null,null,null,"",null,"",null,"",null,"",null,"",null,""]
[280,280,"Coleman, Erik FA S",69.25,5.7709999999999999,7.5,7.5,1.5,9,null,0,5.75,1.5,14.5,10.5,1.5,10,0,null,null,null,null,"Free Agent","-",null,null,"Coleman, Erik FA S",null,null,null,null,null,null,null,null,null,null,null,null,null,"",null,"",null,"",null,"",null,"",null,""]
[281,281,"Coleman, Kenyon DAL DE",36.75,5.25,2.5,5,null,null,"B",10,1.25,13,2.5,2.5,null,null,null,null,null,null,null,"Free Agent (O)",5,null,null,"Coleman, Kenyon DAL DE",null,null,null,null,null,null,null,null,null,null,null,null,null,"",null,"",null,"",null,"",null,"",null,""]
[282,282,"Coleman, Kurt PHI S",144.30000000000001,10.307,22.3,9,15.5,7.5,9.25,9.75,"B",14.5,6,11.5,9.75,3.75,6.75,null,null,7.5,11.25,"Free Agent",7,null,null,"Coleman, Kurt PHI S",null,null,null,null,null,null,null,null,null,null,null,null,null,"",null,"",null,"",null,"",null,"",null,""]
[283,283,"Collie, Austin IND WR",1.85,1.85,null,null,1.85,"B",null,null,null,null,null,null,null,null,null,null,null,null,null,"Free Agent",4,null,null,"Collie, Austin IND WR",null,null,null,null,null,null,null,null,null,null,null,null,null,"",null,"",null,"",null,"",null,"",null,""]
[284,284,"Collins, Jed NOS RB",30,2,0,0,7.6,2.2000000000000002,0,"B",1.1000000000000001,0,1.1000000000000001,0,4.0999999999999996,8.9,2.2000000000000002,-0.1,1.4,null,1.5,"Free Agent",6,null,null,"Collins, Jed NOS RB",null,null,null,null,null,null,null,null,null,null,null,null,null,"",null,"",null,"",null,"",null,"",null,""]
[285,285,"Colston, Marques NOS WR",275.27,17.204000000000001,9.1,8.65,7.75,35.61,43.35,"B",22.05,12.55,15.6,12.35,11.9,14.6,14.6,8.1,9.75,25.86,23.45,"I like my Women like I like my coffee, _______. (Q)",6,null,null,"Colston, Marques NOS WR",null,null,null,null,null,null,null,null,null,null,null,null,null,"",null,"",null,"",null,"",null,"",null,""]
[286,286,"Cone, Kevin ATL WR",0,0,0,0,0,0,0,0,"B",0,null,null,null,0,0,0,0,0,null,"Free Agent",7,null,null,"Cone, Kevin ATL WR",null,null,null,null,null,null,null,null,null,null,null,null,null,"",null,"",null,"",null,"",null,"",null,""]
[287,287,"Conner, John CIN RB",0,0,0,0,null,0,null,null,null,"B",null,null,null,null,null,null,null,0,0,"Free Agent",8,null,null,"Conner, John CIN RB",null,null,null,null,null,null,null,null,null,null,null,null,null,"",null,"",null,"",null,"",null,"",null,""]
[288,288,"Conner, Kavell IND LB",86.25,6.6349999999999998,8.5,15.25,9,"B",7,7.5,5.75,6.25,7,1.5,2.25,4.75,7.75,3.75,null,null,null,"Free Agent",4,null,null,"Conner, Kavell IND LB",null,null,null,null,null,null,null,null,null,null,null,null,null,"",null,"",null,"",null,"",null,"",null,""]
[289,289,"Connor, Dan DAL LB",68.5,4.8929999999999998,0,3.75,0.75,0,"B",3,4,2.25,null,null,5.25,4.75,8,3,7.5,15.25,11,"Free Agent",5,null,null,"Connor, Dan DAL LB",null,null,null,null,null,null,null,null,null,null,null,null,null,"",null,"",null,"",null,"",null,"",null,""]
[290,290,"Conrath, Matt STL DT",0,0,null,null,null,null,null,null,null,null,"B",0,null,null,null,null,null,null,null,"Free Agent",9,null,null,"Conrath, Matt STL DT",null,null,null,null,null,null,null,null,null,null,null,null,null,"",null,"",null,"",null,"",null,"",null,""]
[291,291,"Considine, Sean BAL S",2.25,0.14099999999999999,0,0,0,0,0,0,0,"B",0,0,0,0,0,0,0,0,2.25,"Free Agent",8,null,null,"Considine, Sean BAL S",null,null,null,null,null,null,null,null,null,null,null,null,null,"",null,"",null,"",null,"",null,"",null,""]
[292,292,"Conte, Chris CHI S",131.5,8.7669999999999995,18.75,4.5,4.5,14.25,7,"B",11.5,9.75,10,5.25,7.5,18.75,1.5,6,9,3.25,null,"Free Agent",6,null,null,"Conte, Chris CHI S",null,null,null,null,null,null,null,null,null,null,null,null,null,"",null,"",null,"",null,"",null,"",null,""]
[293,293,"Cook, Chris MIN CB",66.599999999999994,6.66,18.850000000000001,8.25,5.25,4,7.75,10,3,3.5,null,null,"B",null,null,null,null,1.5,4.5,"Free Agent",11,null,null,"Cook, Chris MIN CB",null,null,null,null,null,null,null,null,null,null,null,null,null,"",null,"",null,"",null,"",null,"",null,""]
[294,294,"Cook, Jared TEN TE",141.30000000000001,10.869,12.4,6.8,21.7,8.1,17.2,11.4,6.7,9,0.6,10.1,"B",13.7,11.1,12.5,null,null,null,"Rancho Cucamonga Ghosts",11,null,null,"Cook, Jared TEN TE",null,null,null,null,null,null,null,null,null,null,null,null,null,"",null,"",null,"",null,"",null,"",null,""]
[295,295,"Cooley, Chris WAS TE",2.2999999999999998,0.28699999999999998,null,null,null,null,null,null,null,0,0,"B",0,null,0,0,0,2.2999999999999998,0,"Free Agent",10,null,null,"Cooley, Chris WAS TE",null,null,null,null,null,null,null,null,null,null,null,null,null,"",null,"",null,"",null,"",null,"",null,""]
[296,296,"Cooper, Josh CLE WR",20.6,3.4329999999999998,null,null,null,null,null,6.4,10.3,0,null,"B",1.85,null,null,null,null,0,2.0499999999999998,"Free Agent",10,null,null,"Cooper, Josh CLE WR",null,null,null,null,null,null,null,null,null,null,null,null,null,"",null,"",null,"",null,"",null,"",null,""]
[297,297,"Cooper, Riley PHI WR",72.11,6.5549999999999997,null,null,null,null,null,4.3,"B",0,0,10.9,12.91,1.95,11.6,8.6999999999999993,11.75,3.05,6.95,"Free Agent",7,null,null,"Cooper, Riley PHI WR",null,null,null,null,null,null,null,null,null,null,null,null,null,"",null,"",null,"",null,"",null,"",null,""]
[298,298,"Coples, Quinton NYJ DE",86.5,5.4059999999999997,1.5,1.25,3,5,0,20.350000000000001,4.5,1.5,"B",3.25,5.5,0,2.5,9.6999999999999993,11.7,13.75,3,"Free Agent",9,null,null,"Coples, Quinton NYJ DE",null,null,null,null,null,null,null,null,null,null,null,null,null,"",null,"",null,"",null,"",null,"",null,""]
[299,299,"Copper, Terrance KCC WR",20.309999999999999,1.3540000000000001,0.64,0,0,0,1.67,0,"B",0,0,0,7.05,4,0,6.95,0,0,null,"Free Agent",7,null,null,"Copper, Terrance KCC WR",null,null,null,null,null,null,null,null,null,null,null,null,null,"",null,"",null,"",null,"",null,"",null,""]
[300,300,"Cosby, Quan FA WR",7.03,3.5150000000000001,null,null,null,null,null,null,null,null,null,null,null,null,5.36,1.67,null,null,null,"Free Agent","-",null,null,"Cosby, Quan FA WR",null,null,null,null,null,null,null,null,null,null,null,null,null,"",null,"",null,"",null,"",null,"",null,""]
[301,301,"Costanzo, Blake CHI LB",5.25,0.375,0,0,0,0,3,"B",0,0,0,0,0,0,0,0,2.25,null,null,"Free Agent",6,null,null,"Costanzo, Blake CHI LB",null,null,null,null,null,null,null,null,null,null,null,null,null,"",null,"",null,"",null,"",null,"",null,""]
[302,302,"Cotchery, Jerricho PIT WR",41.75,3.2120000000000002,0,1.85,2.15,"B",1.95,0,3.25,null,10,3.45,4.7,null,null,0,5.3,4.5,4.5999999999999996,"Free Agent",4,null,null,"Cotchery, Jerricho PIT WR",null,null,null,null,null,null,null,null,null,null,null,null,null,"",null,"",null,"",null,"",null,"",null,""]
[303,303,"Cousins, Kirk WAS QB",36.130000000000003,12.042999999999999,null,null,null,null,3.44,null,null,null,null,"B",null,null,null,8.0399999999999991,24.65,null,null,"Free Agent",10,null,null,"Cousins, Kirk WAS QB",null,null,null,null,null,null,null,null,null,null,null,null,null,"",null,"",null,"",null,"",null,"",null,""]
[304,304,"Cox, Derek JAC CB",140.05000000000001,11.670999999999999,null,null,4.5,7.75,16,"B",17.7,null,7.5,4.5,35.6,5.5,null,10,7.5,18.5,5,"Free Agent",6,null,null,"Cox, Derek JAC CB",null,null,null,null,null,null,null,null,null,null,null,null,null,"",null,"",null,"",null,"",null,"",null,""]
[305,305,"Cox, Fletcher PHI DT",141.65,9.4429999999999996,11.7,16,1.75,7.5,2.5,2.5,"B",17,5.5,9.1999999999999993,27.75,2.5,0,16.8,18.45,2.5,null,"Free Agent",7,null,null,"Cox, Fletcher PHI DT",null,null,null,null,null,null,null,null,null,null,null,null,null,"",null,"",null,"",null,"",null,"",null,""]
[306,306,"Cox, Mike ATL RB",5.2,0.65,null,null,null,null,null,null,"B",null,null,0,0,0,1.8,0,2.1,0,1.3,"Free Agent",7,null,null,"Cox, Mike ATL RB",null,null,null,null,null,null,null,null,null,null,null,null,null,"",null,"",null,"",null,"",null,"",null,""]
[307,307,"Cox, Perrish SFO CB",23,1.4379999999999999,3,1.5,0,0,1.5,0,0,7,"B",4.5,0,0,0.75,1.5,0.75,0,2.5,"Free Agent",9,null,null,"Cox, Perrish SFO CB",null,null,null,null,null,null,null,null,null,null,null,null,null,"",null,"",null,"",null,"",null,"",null,""]
[308,308,"Crabtree, Michael SFO WR",275.99,17.248999999999999,16.350000000000001,14.2,11.5,4,24.8,6.35,8.1,26.25,"B",19.25,12.85,6.35,18.850000000000001,20.55,31.45,11.5,43.64,"Polk High (O)",9,null,null,"Crabtree, Michael SFO WR",null,null,null,null,null,null,null,null,null,null,null,null,null,"",null,"",null,"",null,"",null,"",null,""]
[309,309,"Crabtree, Tom GBP TE",54.3,3.879,0,10.199999999999999,null,3.1,2.1,17.2,0,0,16.7,"B",0,0,5,0,0,null,0,"Free Agent",10,null,null,"Crabtree, Tom GBP TE",null,null,null,null,null,null,null,null,null,null,null,null,null,"",null,"",null,"",null,"",null,"",null,""]
[310,310,"Crawford, Jack OAK DE",6.25,1.5620000000000001,null,null,0,3.75,"B",null,null,null,null,null,2.5,null,null,null,null,0,null,"Free Agent",5,null,null,"Crawford, Jack OAK DE",null,null,null,null,null,null,null,null,null,null,null,null,null,"",null,"",null,"",null,"",null,"",null,""]
[311,311,"Crawford, Richard WAS CB",45.85,4.585,0,3,3.75,4.5,4.5,0,null,null,null,"B",null,null,null,6.67,1.2,9.08,13.15,"Free Agent (Q)",10,null,null,"Crawford, Richard WAS CB",null,null,null,null,null,null,null,null,null,null,null,null,null,"",null,"",null,"",null,"",null,"",null,""]
[312,312,"Crawford, Tyrone DAL DE",45,2.8119999999999998,0,1.25,5,2.5,"B",0,0,2.5,0,0,5,12.5,3.75,1.25,2.5,5,3.75,"Free Agent (O)",5,null,null,"Crawford, Tyrone DAL DE",null,null,null,null,null,null,null,null,null,null,null,null,null,"",null,"",null,{"$f":"IF(ISNUMBER(SEARCH(\"*Total Starters:*\",BA323)),BB323,\"\")","v":""},null,"",null,"",null,""]
[313,313,"Cribbs, Josh CLE WR",79.040000000000006,4.9400000000000004,8.84,8.85,7.92,1.53,6.64,4.32,6.25,-0.7,6.56,"B",4.7699999999999996,1.8,1.79,5.5,10.24,0.43,4.3,"Free Agent (Q)",10,null,null,"Cribbs, Josh CLE WR",null,null,null,null,null,null,null,null,null,null,null,null,null,{"$f":"IF(ISNUMBER(SEARCH(\"*Minimum Auction Opening Bid:*\",BA324)),BB324,\"\")","v":""},null,{"$f":"IF(ISNUMBER(SEARCH(\"*All Auction Bids Must Be In Increments Of:*\",BA324)),BB324,\"\")","v":""},null,"",null,{"$f":"IF(ISNUMBER(SEARCH(\"Number of Roster Spots:*\",BA324)),BB324,\"\")","v":""},null,{"$f":"IF(ISNUMBER(SEARCH(\"Number of Roster Spots:*\",BA324)),BB324,\"\")","v":""},null,{"$f":"IF(ISNUMBER(SEARCH(\"*Starting Auction Funds Available To Each Franchise:*\",BA324)),BB324,\"\")","v":""}]
[314,314,"Crick, Jared HOU DE",49.25,3.2829999999999999,2.5,2.5,0,0,null,7.5,3.75,"B",3.75,0,2.5,9.25,5,5,2.5,2.5,2.5,"Free Agent",8,null,null,"Crick, Jared HOU DE",null,null,null,null,null,null,null,null,null,null,null,null,null,"",null,"",null,"",null,"",null,"",null,""]
[315,315,"Criner, Juron OAK WR",41.1,3.4249999999999998,0,null,null,5.4,"B",0,0,0,2,5.0999999999999996,12.05,6.05,5.6,4.9000000000000004,0,null,null,"Free Agent",5,null,null,"Criner, Juron OAK WR",null,null,null,null,null,null,null,null,null,null,null,null,null,"",null,"",null,"",null,"",null,"",null,""]
[316,316,"Crocker, Chris CIN S",87.2,6.7080000000000002,null,null,null,11.3,0,0,9.75,"B",9,4.5,3,17.149999999999999,6.75,6.25,8.5,9.5,1.5,"Free Agent",8,null,null,"Crocker, Chris CIN S",null,null,null,null,null,null,null,null,null,null,null,null,null,"",null,"",null,"",null,"",null,"",null,""]
[317,317,"Cromartie, Antonio NYJ CB",109.23,6.827,22,3.75,5.5,9.5,9,17.350000000000001,4,3,"B",7.75,4,0,6.38,7,4,3,3,"Free Agent",9,null,null,"Cromartie, Antonio NYJ CB",null,null,null,null,null,null,null,null,null,null,null,null,null,"",null,"",null,"",null,"",null,"",null,""]
[318,318,"Crosby, Mason GBP PK",113.5,7.0940000000000003,2,13,6.5,4,3,6,13,3,6,"B",5,4,11.5,10,1,13.5,12,"Free Agent",10,null,null,"Crosby, Mason GBP PK",null,null,null,null,null,null,null,null,null,null,null,null,null,"",null,"",null,"",null,"",null,"",null,""]
[319,319,"Cruz, Victor NYG WR",283.27999999999997,17.704999999999998,13.3,42.23,11.7,28.15,29.25,19.3,28.85,4.8,12.95,6.35,"B",13.35,17.649999999999999,28.1,5.25,5.85,16.2,"Klingon Warriors",11,null,null,"Cruz, Victor NYG WR",null,null,null,null,null,null,null,null,null,null,null,null,null,"",null,"",null,"",null,"",null,"",null,""]
[320,320,"Culliver, Chris SFO CB",112.65,7.0410000000000004,8.5,5.5,2.25,1.5,10.15,6,8,22,"B",2.25,4.5,3.75,10.75,8.25,11.5,2.25,5.5,"Free Agent (O)",9,null,null,"Culliver, Chris SFO CB",null,null,null,null,null,null,null,null,null,null,null,null,null,"",null,"",null,"",null,"",null,"",null,""]
[321,321,"Culver, Tyrone MIA S",0,0,null,null,null,null,null,null,"B",null,null,null,null,null,null,0,0,0,0,"Free Agent",7,null,null,{"$f":"IF(ISBLANK(C331),\"\",C331)","v":"Culver, Tyrone MIA S"},null,null,null,null,null,null,null,null,null,null,null,null,null,"",null,"",null,"",null,"",null,"",null,""]
[322,322,"Cumberland, Jeff NYJ TE",97.4,6.4930000000000003,7.8,4.3,5.5,7.7,14.1,0,1.9,null,"B",0,2.2000000000000002,11.8,11.5,5.2,17.3,0,8.1,"Free Agent",9,null,null,"Cumberland, Jeff NYJ TE",null,null,null,null,null,null,null,null,null,null,null,null,null,"",null,"",null,"",null,"",null,"",null,""]
[323,323,"Cundiff, Billy FA* PK",32.5,6.5,17,4,7,2.5,2,null,null,null,null,null,null,null,null,null,null,null,null,"Free Agent","-",null,null,"Cundiff, Billy FA* PK",null,null,null,null,null,null,null,null,null,null,null,null,null,"",null,"",null,"",null,"",null,"",null,""]
[324,324,"Cunningham, Jermaine NEP DE",72.5,6.0419999999999998,12.95,1.25,5,2.5,3.75,3.75,7.45,5,"B",11.1,3.75,13.5,null,null,null,null,2.5,"Free Agent",9,null,null,"Cunningham, Jermaine NEP DE",null,null,null,null,null,null,null,null,null,null,null,null,null,"",null,"",null,"",null,"",null,"",null,""]
[325,325,"Curry, Aaron FA LB",2.5,1.25,null,null,null,null,null,null,null,null,null,2.5,0,null,null,null,null,null,null,"Free Agent","-",null,null,"Curry, Aaron FA LB",null,null,null,null,null,null,null,null,null,null,null,null,null,"",null,"",null,"",null,"",null,"",null,""]
[326,326,"Curry, Vinny PHI DE",22.25,3.7080000000000002,null,null,null,null,null,null,"B",null,null,null,null,12.5,2.5,4.75,2.5,0,0,"Free Agent",7,null,null,"Curry, Vinny PHI DE",null,null,null,null,null,null,null,null,null,null,null,null,null,"",null,"",null,"",null,"",null,"",null,""]
[327,327,"Cushing, Brian HOU LB",52.35,10.47,21.35,3,9.25,12.75,6,null,null,"B",null,null,null,null,null,null,null,null,null,"Rancho Cucamonga Ghosts",8,null,null,"Cushing, Brian HOU LB",null,null,null,null,null,null,null,null,null,null,null,null,null,"",null,"",null,"",null,"",null,"",null,""]
[328,328,"Cutler, Jay CHI QB",152.25,10.15,22.25,-7.76,4.12,16,19.88,"B",9.4,-2.16,20.36,-0.7,null,9.42,22.32,8,3.3,10.64,17.18,"The Black Champion",6,null,null,"Cutler, Jay CHI QB",null,null,null,null,null,null,null,null,null,null,null,null,null,"",null,"",null,"",null,"",null,"",null,""]
[329,329,"Dahl, Craig STL S",109.29,6.8310000000000004,10.5,8.25,6,4.5,7.5,9,4.75,10.74,"B",4.5,1.5,12.8,5.25,4.5,6,5.25,8.25,"Free Agent",9,null,null,"Dahl, Craig STL S",null,null,null,null,null,null,null,null,null,null,null,null,null,"",null,"",null,"",null,"",null,"",null,""]
[330,330,"Dalton, Andy CIN QB",234.03,14.627000000000001,-0.06,24.3,30,24.26,7.46,22.55,6.1,"B",11.56,28.76,25.5,23.9,12.94,5.24,5.88,-0.88,6.52,"Klingon Warriors",8,null,null,"Dalton, Andy CIN QB",null,null,null,null,null,null,null,null,null,null,null,null,null,"",null,"",null,"",null,"",null,"",null,""]
[331,331,"Daniel, Chase NOS QB",2.1,0.13100000000000001,0,0,0,0,0,"B",0,0,0,0,2.1,0,0,0,0,0,0,"Free Agent",6,null,null,"Daniel, Chase NOS QB",null,null,null,null,null,null,null,null,null,null,null,null,null,"",null,"",null,"",null,"",null,"",null,""]
[332,332,"Daniels, Matt STL S",0,0,0,0,null,null,null,null,0,0,"B",null,null,null,null,null,null,null,null,"Free Agent (P)",9,null,null,"Daniels, Matt STL S",null,null,null,null,null,null,null,null,null,null,null,null,null,"",null,"",null,"",null,"",null,"",null,""]
[333,333,"Daniels, Mike GBP DT",57.1,4.0789999999999997,null,8.6,0,0,null,5,0,0,12,"B",2,5.5,0,13,5,6,0,"Free Agent",10,null,null,"Daniels, Mike GBP DT",null,null,null,null,null,null,null,null,null,null,null,null,null,"",null,"",null,"",null,"",null,"",null,""]
[334,334,"Daniels, Owen HOU TE",200.6,13.372999999999999,14.7,13.7,13.1,22.2,19.899999999999999,9.1,22.4,"B",18.2,null,14.7,14,8.8000000000000007,5.4,10,7.2,7.2,"Derek's Daycare ",8,null,null,"Daniels, Owen HOU TE",null,null,null,null,null,null,null,null,null,null,null,null,null,"",null,"",null,"",null,"",null,"",null,""]
[335,335,"Daniels, Travis KCC CB",24.25,1.617,4.5,0.75,4,3,1.5,1.5,"B",1.5,2.25,0,null,1.5,1.5,0,2.25,0,0,"Free Agent",7,null,null,"Daniels, Travis KCC CB",null,null,null,null,null,null,null,null,null,null,null,null,null,"",null,"",null,"",null,"",null,"",null,""]
[336,336,"Dansby, Karlos MIA LB",216.15,13.509,12.25,13.75,13.75,18.649999999999999,7.5,12.75,"B",12.25,14.25,10,11.25,10.75,17.75,16.5,11.5,18,15.25,"Hurry Up and Happy Birthday, Donny (P)",7,null,null,"Dansby, Karlos MIA LB",null,null,null,null,null,null,null,null,null,null,null,null,null,"",null,"",null,"",null,"",null,"",null,""]
[337,337,"Dareus, Marcell BUF DT",137.44999999999999,8.5909999999999993,2.5,12.3,4.75,9.5500000000000007,7,5,2.5,"B",5,19.55,10,19.2,0,6.25,5,23.1,5.75,"Free Agent",8,null,null,"Dareus, Marcell BUF DT",null,null,null,null,null,null,null,null,null,null,null,null,null,"",null,"",null,"",null,"",null,"",null,""]
[338,338,"David, Lavonte TBB LB",236.35,14.772,7.5,12.75,8.5,21,"B",10.75,14.5,2.25,23.5,21.25,12.25,12.25,28.45,18,9.25,16,18.149999999999999,"Angry Neighbors",5,null,null,"David, Lavonte TBB LB",null,null,null,null,null,null,null,null,null,null,null,null,null,"",null,"",null,"",null,"",null,"",null,""]
[339,339,"Davis, Demario NYJ LB",40,2.5,0,0,0,1.5,0,4,8.25,7.5,"B",3.75,3,9,0,0,0,0,3,"I like my Women like I like my coffee, _______.",9,null,null,"Davis, Demario NYJ LB",null,null,null,null,null,null,null,null,null,null,null,null,null,"",null,"",null,"",null,"",null,"",null,""]
[340,340,"Davis, Drew ATL WR",15,1,null,0,0,0,0,0,"B",11.5,0,0,1.65,0,0,1.85,0,0,0,"Free Agent",7,null,null,"Davis, Drew ATL WR",null,null,null,null,null,null,null,null,null,null,null,null,null,"",null,"",null,"",null,"",null,"",null,""]
[341,341,"Davis, Fred WAS TE",68.5,9.7859999999999996,6.8,4.4000000000000004,19.5,13,12.9,9.1,2.8,null,null,"B",null,null,null,null,null,null,null,"Roddy White Man Can't Jump",10,null,null,"Davis, Fred WAS TE",null,null,null,null,null,null,null,null,null,null,null,null,null,"",null,"",null,"",null,"",null,"",null,""]
[342,342,"Davis, Kellen CHI TE",60.4,3.7749999999999999,0,9.6,5,10.7,5.6,"B",1.8,8.6999999999999993,0,-0.9,5,3,0,7,0,4.9000000000000004,0,"Free Agent",6,null,null,"Davis, Kellen CHI TE",null,null,null,null,null,null,null,null,null,null,null,null,null,"",null,"",null,"",null,"",null,"",null,""]
[343,343,"Davis, Thomas CAR LB",149.75,9.9830000000000005,2.25,4.75,null,3,7.75,"B",14.25,6.75,14.5,4.5,22.5,7.75,17.5,15,14.25,9.75,5.25,"Free Agent (P)",6,null,null,"Davis, Thomas CAR LB",null,null,null,null,null,null,null,null,null,null,null,null,null,"",null,"",null,"",null,"",null,"",null,""]
[344,344,"Davis, Vernon SFO TE",148.30000000000001,9.2690000000000001,14.8,26.8,18.8,5.8,20.100000000000001,8.1999999999999993,0,6.4,"B",9,23.3,0,4.5,1.9,2.5,4.2,2,"Angry Neighbors (P)",9,null,null,"Davis, Vernon SFO TE",null,null,null,null,null,null,null,null,null,null,null,null,null,"",null,"",null,"",null,"",null,"",null,""]
[345,345,"Davis, Vontae IND CB",117.65,11.765000000000001,7.5,9,5.5,"B",null,null,4.5,1.5,null,null,null,null,11.5,21.05,13.5,16,27.6,"Free Agent",4,null,null,"Davis, Vontae IND CB",null,null,null,null,null,null,null,null,null,null,null,null,null,"",null,"",null,"",null,"",null,"",null,""]
[346,346,"Dawson, Keyunta TEN DE",6.25,2.0830000000000002,0,6.25,0,null,null,null,null,null,null,null,"B",null,null,null,null,null,null,"Free Agent",11,null,null,"Dawson, Keyunta TEN DE",null,null,null,null,null,null,null,null,null,null,null,null,null,"",null,"",null,"",null,"",null,"",null,""]
[347,347,"Dawson, Phil CLE PK",125.5,7.8440000000000003,11,10.5,2,14.5,9.5,10.5,1,1,15.5,"B",9.5,8,5.5,12,3,7.5,4.5,"Free Agent",10,null,null,"Dawson, Phil CLE PK",null,null,null,null,null,null,null,null,null,null,null,null,null,"",null,"",null,"",null,"",null,"",null,""]
[348,348,"DeCoud, Thomas ATL S",171.9,10.744,9.75,16.5,24.3,6,13.65,10,"B",18.45,4.5,6.75,1.5,3,18,5.5,13.25,8.25,12.5,"Free Agent",7,null,null,"DeCoud, Thomas ATL S",null,null,null,null,null,null,null,null,null,null,null,null,null,"",null,"",null,"",null,"",null,"",null,""]
[349,349,"DeOssie, Zak NYG LB",3,0.188,0,0,0,0,0,0,0,3,0,0,"B",0,0,0,0,0,0,"Free Agent",11,null,null,"DeOssie, Zak NYG LB",null,null,null,null,null,null,null,null,null,null,null,null,null,"",null,"",null,"",null,"",null,"",null,""]
[350,350,"Deaderick, Brandon NEP DT",51.2,3.657,2.5,0,null,null,0,0,0,5,"B",0,6.75,1.25,10.5,8.5,1.25,3.75,11.7,"Free Agent",9,null,null,"Deaderick, Brandon NEP DT",null,null,null,null,null,null,null,null,null,null,null,null,null,"",null,"",null,"",null,"",null,"",null,""]
[351,351,"Decker, Eric DEN WR",294.12,18.382999999999999,11.65,10.9,24.47,22.65,13.1,24.3,"B",21.3,31.9,4,10.8,11.4,4.2,18.8,30.3,26,28.35,"Polk High",7,null,null,"Decker, Eric DEN WR",null,null,null,null,null,null,null,null,null,null,null,null,null,"",null,"",null,"",null,"",null,"",null,""]
[352,352,"Delmas, Louis DET S",62,7.75,null,null,null,null,"B",19,3.75,4.5,null,null,null,6,3.75,null,5.5,11.75,7.75,"Free Agent (P)",5,null,null,"Delmas, Louis DET S",null,null,null,null,null,null,null,null,null,null,null,null,null,"",null,"",null,"",null,"",null,"",null,""]
[353,353,"Demps, Quintin HOU S",51,4.25,2.25,3,12.25,3,null,null,null,"B",11,1.5,2.5,2.25,5.5,2.25,2.5,null,3,"Free Agent",8,null,null,"Demps, Quintin HOU S",null,null,null,null,null,null,null,null,null,null,null,null,null,"",null,"",null,"",null,"",null,"",null,""]
[354,354,"Dennard, Alfonzo NEP CB",103.75,10.375,null,null,null,null,4,3.75,10.5,15.8,"B",7.5,30.7,13,8.5,8.5,1.5,null,null,"Free Agent (Q)",9,null,null,"Dennard, Alfonzo NEP CB",null,null,null,null,null,null,null,null,null,null,null,null,null,"",null,"",null,"",null,"",null,"",null,""]
[355,355,"Dent, Akeem ATL LB",85.75,5.359,0,0,3,6.25,2.25,10.5,"B",4,10.75,11.25,7.25,7,1.5,9,2.25,3.75,7,"Free Agent",7,null,null,"Dent, Akeem ATL LB",null,null,null,null,null,null,null,null,null,null,null,null,null,"",null,"",null,"",null,"",null,"",null,""]
[356,356,"Devito, Mike NYJ DE",115.05,7.1909999999999998,3.75,10,7.5,5,15,2.5,6.25,3.75,"B",20.8,0,8.75,1.25,0,17.75,2.5,10.25,"Free Agent",9,null,null,"Devito, Mike NYJ DE",null,null,null,null,null,null,null,null,null,null,null,null,null,"",null,"",null,"",null,"",null,"",null,""]
[357,357,"Dickerson, Dorin BUF RB",22.2,2.2200000000000002,0,0,null,6.6,null,null,0,"B",2.8,0,1.9,0,null,null,2.5,8.4,null,"Free Agent (Q)",8,null,null,"Dickerson, Dorin BUF RB",null,null,null,null,null,null,null,null,null,null,null,null,null,"",null,"",null,"",null,"",null,"",null,""]
[358,358,"Dickson, Ed BAL TE",56,4.3079999999999998,5.2,3.8,3.5,0,2.6,2.2999999999999998,2,"B",4.0999999999999996,10.9,3.8,0,null,null,null,2.4,15.4,"Roddy White Man Can't Jump (Q)",8,null,null,"Dickson, Ed BAL TE",null,null,null,null,null,null,null,null,null,null,null,null,null,"",null,"",null,"",null,"",null,"",null,""]
[359,359,"Diles, Zach TEN LB",13.5,2.25,null,0.75,0.75,5.25,4.5,0,2.25,null,null,null,"B",null,null,null,null,null,null,"Free Agent",11,null,null,"Diles, Zach TEN LB",null,null,null,null,null,null,null,null,null,null,null,null,null,"",null,"",null,"",null,"",null,"",null,""]
[360,360,"Dixon, Anthony SFO RB",20.8,1.3,0,0,0,2.6,8.1,0,0,0,"B",0,0.6,0.5,0,6.9,0.7,0.8,0.6,"Free Agent",9,null,null,"Dixon, Anthony SFO RB",null,null,null,null,null,null,null,null,null,null,null,null,null,"",null,"",null,"",null,"",null,"",null,""]
[361,361,"Dixon, Antonio PHI DT",13,4.3330000000000002,null,null,null,null,null,3.75,"B",null,null,null,null,null,null,null,null,null,9.25,"Free Agent",7,null,null,"Dixon, Antonio PHI DT",null,null,null,null,null,null,null,null,null,null,null,null,null,"",null,"",null,"",null,"",null,"",null,""]
[362,362,"Dobbins, Tim HOU LB",71.45,5.1040000000000001,1.5,0,null,3,6.25,0,5.5,"B",6.75,11.5,2.5,null,15.2,3.75,5.5,9.25,0.75,"Free Agent (P)",8,null,null,"Dobbins, Tim HOU LB",null,null,null,null,null,null,null,null,null,null,null,null,null,"",null,"",null,"",null,"",null,"",null,""]
[363,363,"Dobbs, Demarcus SFO DE",7.5,0.625,0,0,0,0,1.25,0,0,0,"B",2.5,3.75,0,null,0,null,null,null,"Free Agent (Q)",9,null,null,"Dobbs, Demarcus SFO DE",null,null,null,null,null,null,null,null,null,null,null,null,null,"",null,"",null,"",null,"",null,"",null,""]
[364,364,"Dockett, Darnell ARI DE",94.25,6.2830000000000004,11.25,12.75,2.5,null,0,5,2.5,18,13.5,"B",10,6.25,5,2.5,2.5,2.5,0,"Free Agent",10,null,null,"Dockett, Darnell ARI DE",null,null,null,null,null,null,null,null,null,null,null,null,null,"",null,"",null,"",null,"",null,"",null,""]
[365,365,"Dorsey, Glenn KCC DE",15.25,3.8119999999999998,6,5,1.75,null,null,null,"B",null,2.5,null,null,null,null,null,null,null,null,"Free Agent",7,null,null,"Dorsey, Glenn KCC DE",null,null,null,null,null,null,null,null,null,null,null,null,null,"",null,"",null,"",null,"",null,"",null,""]
[366,366,"Doss, Tandon BAL WR",30.58,2.1840000000000002,0,1.85,0,5.15,0,0,8.75,"B",0,3.85,0.53,2.48,0,0,7.97,null,null,"Free Agent",8,null,null,"Doss, Tandon BAL WR",null,null,null,null,null,null,null,null,null,null,null,null,null,"",null,"",null,"",null,"",null,"",null,""]
[367,367,"Doucet, Early ARI WR",58.32,4.8600000000000003,7.45,6.57,0,8.1,6.65,1.35,7.55,4.5999999999999996,0,"B",9.0500000000000007,null,3.8,3.2,null,null,null,"Free Agent",10,null,null,"Doucet, Early ARI WR",null,null,null,null,null,null,null,null,null,null,null,null,null,"",null,"",null,"",null,"",null,"",null,""]
[368,368,"Doughty, Reed WAS S",74.849999999999994,4.6779999999999999,7.6,0,0,9,3.75,7.25,9,5.25,12,"B",0,0,3.75,5,6.25,3,3,"Free Agent",10,null,null,"Doughty, Reed WAS S",null,null,null,null,null,null,null,null,null,null,null,null,null,"",null,"",null,"",null,"",null,"",null,""]
[369,369,"Douglas, David TBB WR",0,0,null,null,null,null,"B",null,null,null,null,null,null,null,null,null,null,null,0,"Free Agent",5,null,null,"Douglas, David TBB WR",null,null,null,null,null,null,null,null,null,null,null,null,null,"",null,"",null,"",null,"",null,"",null,""]
[370,370,"Douglas, Harry ATL WR",93.62,6.2409999999999997,4.2699999999999996,6.45,3.8,1.85,6.4,9.9499999999999993,"B",null,0,9.9,11.05,3.6,0,5.4,11.95,3.1,15.9,"Free Agent",7,null,null,"Douglas, Harry ATL WR",null,null,null,null,null,null,null,null,null,null,null,null,null,"",null,"",null,"",null,"",null,"",null,""]
[371,371,"Dowling, Ras-I NEP CB",11.5,1.917,5.25,null,0,1.5,2.25,0,2.5,null,"B",null,null,null,null,null,null,null,null,"Free Agent",9,null,null,"Dowling, Ras-I NEP CB",null,null,null,null,null,null,null,null,null,null,null,null,null,"",null,"",null,"",null,"",null,"",null,""]
[372,372,"Dowtin, Marcus PHI LB",0,0,null,null,null,null,null,null,"B",0,null,0,null,null,null,null,null,null,null,"Free Agent",7,null,null,"Dowtin, Marcus PHI LB",null,null,null,null,null,null,null,null,null,null,null,null,null,"",null,"",null,"",null,"",null,"",null,""]
[373,373,"Draughn, Shaun KCC RB",93.58,5.8490000000000002,12.1,8.9,9.2799999999999994,8.64,8.7799999999999994,5.3,"B",4.4800000000000004,14.02,1.36,5.86,3.42,1.24,2.6,4.0999999999999996,0.4,3.1,"Free Agent",7,null,null,"Draughn, Shaun KCC RB",null,null,null,null,null,null,null,null,null,null,null,null,null,"",null,"",null,"",null,"",null,"",null,""]
[374,374,"Dray, Jim ARI TE",4.5,0.34599999999999997,0,null,0,null,null,0,0,0,0,"B",0,0,0,0,0,1.8,2.7,"Free Agent",10,null,null,"Dray, Jim ARI TE",null,null,null,null,null,null,null,null,null,null,null,null,null,"",null,"",null,"",null,"",null,"",null,""]
[375,375,"Dreessen, Joel DEN TE",127.1,7.944,2.1,4.5999999999999996,12.6,10.7,14.1,14.7,"B",0,15.8,6.1,8.8000000000000007,3.3,0,16.5,6.6,6.7,4.5,"Free Agent (Q)",7,null,null,"Dreessen, Joel DEN TE",null,null,null,null,null,null,null,null,null,null,null,null,null,"",null,"",null,"",null,"",null,"",null,""]
[376,376,"Driver, Donald GBP WR",29.7,2.2850000000000001,0,9.85,0,1.55,2.65,0,1.45,9.5,2.25,"B",2.4500000000000002,0,null,0,null,0,null,"Free Agent",10,null,null,"Driver, Donald GBP WR",null,null,null,null,null,null,null,null,null,null,null,null,null,"",null,"",null,{"$f":"IF(ISNUMBER(SEARCH(\"*Total Starters:*\",BA387)),BB387,\"\")","v":""},null,"",null,"",null,""]
[377,377,"Dumervil, Elvis DEN DE",162.30000000000001,10.144,4.5,3.75,15.35,17.399999999999999,12.25,29.9,"B",0.75,12.6,12.9,17,3,3,0,11.15,17.25,1.5,"BELAC",7,null,null,"Dumervil, Elvis DEN DE",null,null,null,null,null,null,null,null,null,null,null,null,null,{"$f":"IF(ISNUMBER(SEARCH(\"*Minimum Auction Opening Bid:*\",BA388)),BB388,\"\")","v":""},null,{"$f":"IF(ISNUMBER(SEARCH(\"*All Auction Bids Must Be In Increments Of:*\",BA388)),BB388,\"\")","v":""},null,"",null,{"$f":"IF(ISNUMBER(SEARCH(\"Number of Roster Spots:*\",BA388)),BB388,\"\")","v":""},null,{"$f":"IF(ISNUMBER(SEARCH(\"Number of Roster Spots:*\",BA388)),BB388,\"\")","v":""},null,{"$f":"IF(ISNUMBER(SEARCH(\"*Starting Auction Funds Available To Each Franchise:*\",BA388)),BB388,\"\")","v":""}]
[378,378,"Dunbar, Jo-Lonn STL LB",226.3,14.144,21.95,11.5,7.25,9,22.25,24.9,4,14.5,"B",6.75,7,14.5,20.3,15.6,11,14.75,21.05,"Hurry Up and Happy Birthday, Donny (S)",9,null,null,"Dunbar, Jo-Lonn STL LB",null,null,null,null,null,null,null,null,null,null,null,null,null,"",null,"",null,"",null,"",null,"",null,""]
[379,379,"Dunbar, Lance DAL RB",26.24,2.1869999999999998,null,null,null,null,"B",1.1000000000000001,0,5.68,5.52,1.68,3.6,7.06,0,1.6,0,0,0,"Free Agent",5,null,null,"Dunbar, Lance DAL RB",null,null,null,null,null,null,null,null,null,null,null,null,null,"",null,"",null,"",null,"",null,"",null,""]
[380,380,"Dunlap, Carlos CIN DE",186.25,13.304,null,null,19.350000000000001,12.6,2.5,5,4.25,"B",8.75,21.1,5,6,35.65,9.9499999999999993,11.5,17.149999999999999,27.45,"I like my Women like I like my coffee, _______. (Q)",8,null,null,"Dunlap, Carlos CIN DE",null,null,null,null,null,null,null,null,null,null,null,null,null,"",null,"",null,"",null,"",null,"",null,""]
[381,381,"Durant, Justin DET LB",157.15,9.8219999999999992,15.25,9.75,7,10.25,"B",13,14.9,10.5,10.5,11.25,7.25,14.75,5.5,5.75,3.75,10.25,7.5,"Free Agent",5,null,null,"Durant, Justin DET LB",null,null,null,null,null,null,null,null,null,null,null,null,null,"",null,"",null,"",null,"",null,"",null,""]
[382,382,"Durham, Kris DET WR",28.5,7.125,null,null,null,null,"B",null,null,null,null,null,null,null,null,10.4,2.65,5.7,9.75,"Free Agent",5,null,null,"Durham, Kris DET WR",null,null,null,null,null,null,null,null,null,null,null,null,null,"",null,"",null,"",null,"",null,"",null,""]
[383,383,"Dwyer, Jonathan PIT RB",96.9,7.4539999999999997,7.4,5,-2,"B",null,null,12.2,12.5,null,7,11.1,1.8,14.7,8,8.1999999999999993,3.9,7.1,"Free Agent",4,null,null,"Dwyer, Jonathan PIT RB",null,null,null,null,null,null,null,null,null,null,null,null,null,"",null,"",null,"",null,"",null,"",null,""]
[384,384,"Eachus, Nate KCC RB",4.7,0.42699999999999999,0,0,0,0,0,4.7,"B",0,null,0,0,0,0,null,null,null,null,"Free Agent",7,null,null,"Eachus, Nate KCC RB",null,null,null,null,null,null,null,null,null,null,null,null,null,"",null,"",null,"",null,"",null,"",null,""]
[385,385,"Easley, Marcus BUF WR",3,1,null,null,null,null,null,null,null,"B",null,null,null,null,2.2000000000000002,null,0.8,null,0,"Free Agent",8,null,null,{"$f":"IF(ISBLANK(C395),\"\",C395)","v":"Easley, Marcus BUF WR"},null,null,null,null,null,null,null,null,null,null,null,null,null,"",null,"",null,"",null,"",null,"",null,""]
[386,386,"Eason, Nicholas ARI DE",25.45,1.591,2.5,2.5,0,2.5,1.25,0,9.1999999999999993,0,0,"B",0,0,3.75,1.25,2.5,0,0,"Free Agent",10,null,null,"Eason, Nicholas ARI DE",null,null,null,null,null,null,null,null,null,null,null,null,null,"",null,"",null,"",null,"",null,"",null,""]
[387,387,"Ebner, Nate NEP S",1.5,0.1,0,0,0,0,0,0,0,1.5,"B",0,0,0,0,0,0,0,null,"Free Agent",9,null,null,"Ebner, Nate NEP S",null,null,null,null,null,null,null,null,null,null,null,null,null,"",null,"",null,"",null,"",null,"",null,""]
[388,388,"Edelman, Julian NEP WR",96.31,10.701000000000001,3.75,12.92,14.03,null,null,null,3.44,3.12,"B",1.95,37.549999999999997,15.33,4.22,null,null,null,null,"Derek's Daycare ",9,null,null,"Edelman, Julian NEP WR",null,null,null,null,null,null,null,null,null,null,null,null,null,"",null,"",null,"",null,"",null,"",null,""]
[389,389,"Edwards, Armanti CAR WR",34.880000000000003,2.3250000000000002,0,0,0.84,2.4500000000000002,0,"B",0,null,10.45,3.51,2,4.5599999999999996,3.99,1.95,0,0,5.13,"Free Agent (P)",6,null,null,"Edwards, Armanti CAR WR",null,null,null,null,null,null,null,null,null,null,null,null,null,"",null,"",null,"",null,"",null,"",null,""]
[390,390,"Edwards, Braylon NYJ WR",48.4,3.7229999999999999,10.55,0,0,0,2.25,10.6,0,null,"B",0,null,0,0,null,8.4499999999999993,7.35,9.1999999999999993,"Free Agent",9,null,null,"Edwards, Braylon NYJ WR",null,null,null,null,null,null,null,null,null,null,null,null,null,"",null,"",null,"",null,"",null,"",null,""]
[391,391,"Edwards, Dwan CAR DT",144.55000000000001,10.324999999999999,29.25,8.1,15.85,6.25,3.75,"B",8.75,12.4,10.8,2.5,8.75,5,17.5,null,null,14.4,1.25,"Free Agent",6,null,null,"Edwards, Dwan CAR DT",null,null,null,null,null,null,null,null,null,null,null,null,null,"",null,"",null,"",null,"",null,"",null,""]
[392,392,"Edwards, Ray FA DE",24.75,2.75,6,0,1.25,8.25,0,5.75,null,0,0,3.5,null,null,null,null,null,null,null,"Free Agent","-",null,null,"Edwards, Ray FA DE",null,null,null,null,null,null,null,null,null,null,null,null,null,"",null,"",null,"",null,"",null,"",null,""]
[393,393,"Edwards, Ron CAR DT",33.049999999999997,3.0049999999999999,2.5,2.5,2.5,9.3000000000000007,3.75,"B",3.75,0,1.25,3.75,2.5,1.25,null,null,null,null,null,"Free Agent",6,null,null,"Edwards, Ron CAR DT",null,null,null,null,null,null,null,null,null,null,null,null,null,"",null,"",null,"",null,"",null,"",null,""]
[394,394,"Edwards, Trent PHI QB",0.56000000000000005,0.56000000000000005,null,null,null,null,null,null,"B",null,null,null,null,null,null,null,null,null,0.56000000000000005,"Free Agent",7,null,null,"Edwards, Trent PHI QB",null,null,null,null,null,null,null,null,null,null,null,null,null,"",null,"",null,"",null,"",null,"",null,""]
[395,395,"Egnew, Michael MIA TE",0,0,null,null,null,null,null,null,"B",null,null,null,null,null,null,null,null,0,0,"Free Agent",7,null,null,"Egnew, Michael MIA TE",null,null,null,null,null,null,null,null,null,null,null,null,null,"",null,"",null,"",null,"",null,"",null,""]
[396,396,"Elam, Abram KCC S",54.5,4.5419999999999998,6.75,11.75,3,5.5,4,0,"B",0,1.5,6,7.5,8.5,0,null,null,null,null,"Free Agent",7,null,null,"Elam, Abram KCC S",null,null,null,null,null,null,null,null,null,null,null,null,null,"",null,"",null,"",null,"",null,"",null,""]
[397,397,"Ellerbe, Dannell BAL LB",156.15,12.012,9.75,12.7,22.45,11.5,3,4.5,18.25,"B",15.95,12.75,16,14.3,null,null,null,7.5,7.5,"The Black Champion",8,null,null,"Ellerbe, Dannell BAL LB",null,null,null,null,null,null,null,null,null,null,null,null,null,"",null,"",null,"",null,"",null,"",null,""]
[398,398,"Elliott, Kevin BUF WR",23.3,1.792,0,0,4.9000000000000004,1.75,4.2,null,0,"B",0,0,0,0,4.9000000000000004,7.55,null,null,null,"Free Agent (Q)",8,null,null,"Elliott, Kevin BUF WR",null,null,null,null,null,null,null,null,null,null,null,null,null,"",null,"",null,"",null,"",null,"",null,""]
[399,399,"Ellis, Kenrick NYJ DT",35.5,2.9580000000000002,2.5,3,0,6.25,12.5,null,null,null,"B",null,2.5,0,0,2.5,0,0,6.25,"Free Agent",9,null,null,"Ellis, Kenrick NYJ DT",null,null,null,null,null,null,null,null,null,null,null,null,null,"",null,"",null,"",null,"",null,"",null,""]
[400,400,"Ellis, Sedrick NOS DT",66.25,4.141,11.25,6.25,5,1.25,5,"B",6,2.5,6,2.5,0,8,0,7.5,1.25,0,3.75,"Free Agent",6,null,null,"Ellis, Sedrick NOS DT",null,null,null,null,null,null,null,null,null,null,null,null,null,"",null,"",null,"",null,"",null,"",null,""]
[401,401,"Ellison, Rhett MIN TE",17,1.0620000000000001,0,0,0,0,6.5,3.1,0,2,1.9,0,"B",0,0,1.3,0,0,2.2000000000000002,"Free Agent",11,null,null,"Ellison, Rhett MIN TE",null,null,null,null,null,null,null,null,null,null,null,null,null,"",null,"",null,"",null,"",null,"",null,""]
[402,402,"English, Larry SDC LB",24.9,1.7789999999999999,0,0,0,4.05,1.5,0,"B",0,null,1.25,0,null,3.75,0,3.25,9.6,1.5,"Free Agent",7,null,null,"English, Larry SDC LB",null,null,null,null,null,null,null,null,null,null,null,null,null,"",null,"",null,"",null,"",null,"",null,""]
[403,403,"Evans, Fred MIN DT",68.900000000000006,4.306,2.5,0,0,5,1.75,0,2.5,3,5.5,6.25,"B",19,6,2.5,0,14.9,0,"Free Agent",11,null,null,"Evans, Fred MIN DT",null,null,null,null,null,null,null,null,null,null,null,null,null,"",null,"",null,"",null,"",null,"",null,""]
[404,404,"Fairley, Nick DET DT",131.05000000000001,10.081,10.25,0,2,2.5,"B",10.95,7.25,0,7.5,18.7,30.95,13.5,6.75,20.7,null,null,null,"Invictus",5,null,null,"Fairley, Nick DET DT",null,null,null,null,null,null,null,null,null,null,null,null,null,"",null,"",null,"",null,"",null,"",null,""]
[405,405,"Farwell, Heath SEA LB",4.5,0.28100000000000003,0,0,0,0,0,0,0,0,0,0,"B",0,0,2.25,2.25,0,0,"Free Agent",11,null,null,"Farwell, Heath SEA LB",null,null,null,null,null,null,null,null,null,null,null,null,null,"",null,"",null,"",null,"",null,"",null,""]
[406,406,"Fasano, Anthony MIA TE",126.7,7.9189999999999996,6.4,10.9,12.2,10.5,7.3,15.3,"B",7.9,2.2999999999999998,1.9,2.2999999999999998,2.5,2.9,9.9,22.6,4.2,7.6,"Free Agent",7,null,null,"Fasano, Anthony MIA TE",null,null,null,null,null,null,null,null,null,null,null,null,null,"",null,"",null,"",null,"",null,"",null,""]
[407,407,"Feely, Jay ARI PK",105.5,6.5940000000000003,8,8.5,9.5,6.5,2,13,2,3,5,"B",13.5,5,6.5,0,9.5,6.5,7,"Free Agent",10,null,null,"Feely, Jay ARI PK",null,null,null,null,null,null,null,null,null,null,null,null,null,"",null,"",null,"",null,"",null,"",null,""]
[408,408,"Fells, Daniel NEP TE",14.5,1.115,null,null,0,3.3,0,5,0,0,"B",0,null,3.9,0,0,0,2.2999999999999998,0,"Free Agent",9,null,null,"Fells, Daniel NEP TE",null,null,null,null,null,null,null,null,null,null,null,null,null,"",null,"",null,"",null,"",null,"",null,""]
[409,409,"Felton, Jerome MIN RB",7.14,0.44600000000000001,0,0,0,0,0,0,0,0,0.64,1.5,"B",0,2.2999999999999998,0,0,0,2.7,"Free Agent (Q)",11,null,null,"Felton, Jerome MIN RB",null,null,null,null,null,null,null,null,null,null,null,null,null,"",null,"",null,"",null,"",null,"",null,""]
[410,410,"Finley, Jermichael GBP TE",169.2,10.574999999999999,21.2,5.6,12,11.4,5.6,4.2,6.1,5.4,2.1,"B",19.100000000000001,9.6,15,4.5999999999999996,13.6,14.5,19.2,"I like my Women like I like my coffee, _______.",10,null,null,"Finley, Jermichael GBP TE",null,null,null,null,null,null,null,null,null,null,null,null,null,"",null,"",null,"",null,"",null,"",null,""]
[411,411,"Finnegan, Cortland STL CB",199,12.438000000000001,33.35,15.5,19.45,12,20.45,7.5,8.25,12.5,"B",6.75,9,16.5,5.25,10.5,12,4.5,5.5,"Polk High",9,null,null,"Finnegan, Cortland STL CB",null,null,null,null,null,null,null,null,null,null,null,null,null,"",null,"",null,"",null,"",null,"",null,""]
[412,412,"Fitzgerald, Larry ARI WR",192.55,12.034000000000001,11.3,1.65,28.65,22.4,19.2,22.8,7.9,11.45,20.9,"B",2.35,6.85,3.55,1.45,7.2,21.1,3.8,"Klingon Warriors",10,null,null,"Fitzgerald, Larry ARI WR",null,null,null,null,null,null,null,null,null,null,null,null,null,"",null,"",null,"",null,"",null,"",null,""]
[413,413,"Fitzpatrick, Ryan BUF QB",199.57,12.473000000000001,14.6,22.52,20.32,24.9,1.1399999999999999,4.62,19.3,"B",3.96,19.05,5.22,9.4,20.28,7.38,2.48,9.4,15,"Free Agent",8,null,null,"Fitzpatrick, Ryan BUF QB",null,null,null,null,null,null,null,null,null,null,null,null,null,"",null,"",null,"",null,"",null,"",null,""]
[414,414,"Flacco, Joe BAL QB",232.31,14.519,17.86,7.28,32.4,22.2,2.88,14.56,0.57999999999999996,"B",12.22,38.15,4.46,17.350000000000001,3.42,14.18,12.96,31.45,0.36,"Derek's Daycare ",8,null,null,"Flacco, Joe BAL QB",null,null,null,null,null,null,null,null,null,null,null,null,null,"",null,"",null,"",null,"",null,"",null,""]
[415,415,"Fleener, Coby IND TE",80.099999999999994,6.6749999999999998,17.2,4.5999999999999996,0,"B",11.6,10.199999999999999,4.7,5.4,null,null,null,null,10.1,2.4,3.6,2.7,7.6,"Invictus (P)",4,null,null,"Fleener, Coby IND TE",null,null,null,null,null,null,null,null,null,null,null,null,null,"",null,"",null,"",null,"",null,"",null,""]
[416,416,"Fleming, Jamell ARI CB",30.75,2.0499999999999998,1.5,4.5,6,3.75,0,7.5,1.5,1.5,4.5,"B",0,0,0,null,0,0,0,"Free Agent (P)",10,null,null,"Fleming, Jamell ARI CB",null,null,null,null,null,null,null,null,null,null,null,null,null,"",null,"",null,"",null,"",null,"",null,""]
[417,417,"Fletcher, Bradley STL CB",63.45,3.9660000000000002,8.75,4,7,7.7,11.25,2.5,7.5,4.75,"B",5.5,0,3,0,0,0,1.5,0,"Free Agent",9,null,null,"Fletcher, Bradley STL CB",null,null,null,null,null,null,null,null,null,null,null,null,null,"",null,"",null,"",null,"",null,"",null,""]
[418,418,"Fletcher, London WAS LB",244.85,15.303000000000001,6.25,19.5,17.75,1.5,21.5,23.75,7.5,8.25,9.75,"B",15.75,16.25,12,15.95,15.8,24.9,28.45,"Hurry Up and Happy Birthday, Donny (P)",10,null,null,"Fletcher, London WAS LB",null,null,null,null,null,null,null,null,null,null,null,null,null,"",null,"",null,"",null,"",null,"",null,""]
[419,419,"Florence, Drayton DET CB",54.4,6.8,5.5,7,null,null,"B",null,null,null,null,null,7.5,11,21.9,0,1.5,0,null,"Free Agent",5,null,null,"Florence, Drayton DET CB",null,null,null,null,null,null,null,null,null,null,null,null,null,"",null,"",null,"",null,"",null,"",null,""]
[420,420,"Flowers, Brandon KCC CB",125,8.3330000000000002,null,4,9.25,14.6,13.4,3.75,"B",9.5,1.5,3,6.75,13.3,3,9.25,8.5,14.7,10.5,"Free Agent",7,null,null,"Flowers, Brandon KCC CB",null,null,null,null,null,null,null,null,null,null,null,null,null,"",null,"",null,"",null,"",null,"",null,""]
[421,421,"Floyd, Malcom SDC WR",181.4,12.957000000000001,17.600000000000001,18.399999999999999,8.9499999999999993,4.8,17.05,12.25,"B",9.3000000000000007,15.8,19.8,11.7,17.5,11.1,10.75,6.4,null,null,"Free Agent (Q)",7,null,null,"Floyd, Malcom SDC WR",null,null,null,null,null,null,null,null,null,null,null,null,null,"",null,"",null,"",null,"",null,"",null,""]
[422,422,"Floyd, Michael ARI WR",125.77,7.8609999999999998,0,0,8.0500000000000007,8.5,2.95,3.65,1.95,9.85,14.25,"B",4.3,8.5,4.7,5.5,7.45,12.2,33.92,"The Black Champion",10,null,null,"Floyd, Michael ARI WR",null,null,null,null,null,null,null,null,null,null,null,null,null,"",null,"",null,"",null,"",null,"",null,""]
[423,423,"Flynn, Matt SEA QB",2.2200000000000002,0.74,null,null,null,null,null,null,null,null,null,null,"B",null,null,2.52,0,-0.3,null,"Free Agent",11,null,null,"Flynn, Matt SEA QB",null,null,null,null,null,null,null,null,null,null,null,null,null,"",null,"",null,"",null,"",null,"",null,""]
[424,424,"Fokou, Moise IND LB",64.349999999999994,4.0220000000000002,2.25,2.75,5.25,"B",13.35,2.25,1.5,0,6,8.5,1.25,5.5,8.25,4.5,3,0,0,"Free Agent",4,null,null,"Fokou, Moise IND LB",null,null,null,null,null,null,null,null,null,null,null,null,null,"",null,"",null,"",null,"",null,"",null,""]
[425,425,"Foles, Nick PHI QB",68.62,9.8030000000000008,null,null,null,null,null,null,"B",null,null,6.76,-4.6399999999999997,3.36,13.04,31.75,6.1,12.25,null,"Free Agent",7,null,null,"Foles, Nick PHI QB",null,null,null,null,null,null,null,null,null,null,null,null,null,"",null,"",null,"",null,"",null,"",null,""]
[426,426,"Folk, Nick NYJ PK",90,5.625,12,4,11,0,5,5,16.5,0,"B",1,8,5,1,5.5,4,5.5,6.5,"Free Agent",9,null,null,"Folk, Nick NYJ PK",null,null,null,null,null,null,null,null,null,null,null,null,null,"",null,"",null,"",null,"",null,"",null,""]
[427,427,"Foote, Larry PIT LB",187.4,11.712,25.75,9,9,"B",14.75,17.600000000000001,6.75,15.55,9.75,7.5,9,7.5,14.75,8.25,7.5,10.25,14.5,"Free Agent",4,null,null,"Foote, Larry PIT LB",null,null,null,null,null,null,null,null,null,null,null,null,null,"",null,"",null,"",null,"",null,"",null,""]
[428,428,"Forbath, Kai WAS PK",89,8.0909999999999993,null,null,null,null,null,9.5,12,6,7.5,"B",7,8.5,5,12,8.5,10,3,"Free Agent",10,null,null,"Forbath, Kai WAS PK",null,null,null,null,null,null,null,null,null,null,null,null,null,"",null,"",null,"",null,"",null,"",null,""]
[429,429,"Forsett, Justin HOU RB",51.3,3.206,0,3.5,0,0,0.6,7.5,3.2,"B",0.7,2.7,7.5,15.7,6.4,3.1,0,0.4,0,"Free Agent (P)",8,null,null,"Forsett, Justin HOU RB",null,null,null,null,null,null,null,null,null,null,null,null,null,"",null,"",null,"",null,"",null,"",null,""]
[430,430,"Fort, L.J. CLE LB",35.35,2.2090000000000001,20.100000000000001,0,0,0.75,10.5,0,0,0,0,"B",0,0,0,0,0,0,4,"Free Agent",10,null,null,"Fort, L.J. CLE LB",null,null,null,null,null,null,null,null,null,null,null,null,null,"",null,"",null,"",null,"",null,"",null,""]
[431,431,"Forte, Matt CHI RB",222.4,14.827,21,12,null,5.9,14.7,"B",13,20.399999999999999,24.8,5.6,9.6999999999999993,3.6,18.600000000000001,17.899999999999999,18.3,16.5,20.399999999999999,"Klingon Warriors",6,null,null,"Forte, Matt CHI RB",null,null,null,null,null,null,null,null,null,null,null,null,null,"",null,"",null,"",null,"",null,"",null,""]
[432,432,"Foster, Arian HOU RB",307.44,19.215,20.5,26.7,17.8,16.399999999999999,27.84,17.100000000000001,23.3,"B",17.100000000000001,22.7,10.5,28.7,16.3,18.5,22.2,1.9,19.899999999999999,"Aaron Hernandez's Pistol Offense (O)",8,null,null,"Foster, Arian HOU RB",null,null,null,null,null,null,null,null,null,null,null,null,null,"",null,"",null,"",null,"",null,"",null,""]
[433,433,"Foster, Mason TBB LB",170.9,10.680999999999999,11,27.75,11.75,12.75,"B",9,7.75,15.5,6.5,11.65,7,8.5,7.5,3.75,6.75,6,17.75,"Aaron Hernandez's Pistol Offense",5,null,null,"Foster, Mason TBB LB",null,null,null,null,null,null,null,null,null,null,null,null,null,"",null,"",null,"",null,"",null,"",null,""]
[434,434,"Francies, Coye OAK S",21,1.4,null,0.52,0,0,"B",0,0,0,0,5.44,3.12,4.68,3.4,0,0,0,3.84,"Free Agent",5,null,null,"Francies, Coye OAK S",null,null,null,null,null,null,null,null,null,null,null,null,null,"",null,"",null,"",null,"",null,"",null,""]
[435,435,"Francis, Justin NEP DE",38.049999999999997,3.8050000000000002,null,null,null,null,null,0,0,0,"B",1.25,null,0,2.5,0,8,0,26.3,"Free Agent",9,null,null,"Francis, Justin NEP DE",null,null,null,null,null,null,null,null,null,null,null,null,null,"",null,"",null,"",null,"",null,"",null,""]
[436,436,"Francois, Rob GBP LB",0,0,0,0,0,0,0,0,0,0,0,"B",0,0,0,0,0,0,0,"Free Agent",10,null,null,"Francois, Rob GBP LB",null,null,null,null,null,null,null,null,null,null,null,null,null,"",null,"",null,"",null,"",null,"",null,""]
[437,437,"Franklin, Aubrayo SDC DT",45,3.75,2.5,2.5,8.75,2.5,5,5,"B",0,5,2.5,null,5,null,2.5,3.75,null,null,"Free Agent",7,null,null,"Franklin, Aubrayo SDC DT",null,null,null,null,null,null,null,null,null,null,null,null,null,"",null,"",null,"",null,"",null,"",null,""]
[438,438,"Franks, Dominique ATL CB",34.619999999999997,2.1640000000000001,0,8.1199999999999992,6.77,1.1299999999999999,0.13,0,"B",0.73,0.4,0.6,2.93,0.67,0.87,0,6.92,1.35,4,"Free Agent",7,null,null,"Franks, Dominique ATL CB",null,null,null,null,null,null,null,null,null,null,null,null,null,"",null,"",null,"",null,"",null,"",null,""]
[439,439,"Freeman, Jerrell IND LB",214.35,13.397,22.4,24.25,12,"B",9,16.75,6.75,18.75,3.25,3,13.25,26.95,10,8.25,13.5,13.5,12.75,"I like my Women like I like my coffee, _______. (P)",4,null,null,"Freeman, Jerrell IND LB",null,null,null,null,null,null,null,null,null,null,null,null,null,"",null,"",null,"",null,"",null,"",null,""]
[440,440,"Freeman, Josh TBB QB",253.7,15.856,9.82,13.72,2.5,15.76,"B",29.9,39.5,25.38,17.28,19.8,22.62,8.24,17.38,16.46,-5.04,9.4,10.98,"Angry Neighbors",5,null,null,"Freeman, Josh TBB QB",null,null,null,null,null,null,null,null,null,null,null,null,null,"",null,"",null,{"$f":"IF(ISNUMBER(SEARCH(\"*Total Starters:*\",BA451)),BB451,\"\")","v":""},null,"",null,"",null,""]
[441,441,"Freeney, Dwight IND DE",56.4,4.0289999999999999,0,null,null,"B",9.4,3.25,1.5,0,10.5,0,2.5,0,0,0.75,9.6999999999999993,8.1999999999999993,10.6,"Free Agent",4,null,null,"Freeney, Dwight IND DE",null,null,null,null,null,null,null,null,null,null,null,null,null,{"$f":"IF(ISNUMBER(SEARCH(\"*Minimum Auction Opening Bid:*\",BA452)),BB452,\"\")","v":""},null,{"$f":"IF(ISNUMBER(SEARCH(\"*All Auction Bids Must Be In Increments Of:*\",BA452)),BB452,\"\")","v":""},null,"",null,{"$f":"IF(ISNUMBER(SEARCH(\"Number of Roster Spots:*\",BA452)),BB452,\"\")","v":""},null,{"$f":"IF(ISNUMBER(SEARCH(\"Number of Roster Spots:*\",BA452)),BB452,\"\")","v":""},null,{"$f":"IF(ISNUMBER(SEARCH(\"*Starting Auction Funds Available To Each Franchise:*\",BA452)),BB452,\"\")","v":""}]
[442,442,"Fua, Sione CAR DT",25.5,1.962,null,0,null,0,5,"B",2.5,0,3.75,0,0,5.5,5,2.5,0,null,1.25,"Free Agent",6,null,null,"Fua, Sione CAR DT",null,null,null,null,null,null,null,null,null,null,null,null,null,"",null,"",null,"",null,"",null,"",null,""]
[443,443,"Fujita, Scott CLE LB",24,6,null,4.5,0,13.5,6,null,null,null,null,"B",null,null,null,null,null,null,null,"Free Agent",10,null,null,"Fujita, Scott CLE LB",null,null,null,null,null,null,null,null,null,null,null,null,null,"",null,"",null,"",null,"",null,"",null,""]
[444,444,"Gabbert, Blaine JAC QB",77.11,7.7110000000000003,18,4.62,11.3,5.34,-6.22,"B",10.4,18.149999999999999,14.2,4.3600000000000003,-3.04,null,null,null,null,null,null,"Free Agent",6,null,null,"Gabbert, Blaine JAC QB",null,null,null,null,null,null,null,null,null,null,null,null,null,"",null,"",null,"",null,"",null,"",null,""]
[445,445,"Gachkar, Andrew SDC LB",27.85,1.7410000000000001,1.5,0,0,0,0,0,"B",0,0,0,0,7.75,0,0,11.85,0,6.75,"Free Agent",7,null,null,"Gachkar, Andrew SDC LB",null,null,null,null,null,null,null,null,null,null,null,null,null,"",null,"",null,"",null,"",null,"",null,""]
[446,446,"Gaffney, Jabar FA* WR",11.8,3.9329999999999998,null,null,null,null,null,null,null,4.25,5.2,2.35,null,null,null,null,null,null,null,"Free Agent","-",null,null,"Gaffney, Jabar FA* WR",null,null,null,null,null,null,null,null,null,null,null,null,null,"",null,"",null,"",null,"",null,"",null,""]
[447,447,"Gaither, Omar OAK LB",17,2.4289999999999998,null,null,null,null,"B",null,null,null,null,null,0,0,3,0.75,0,5.5,7.75,"Free Agent",5,null,null,"Gaither, Omar OAK LB",null,null,null,null,null,null,null,null,null,null,null,null,null,"",null,"",null,"",null,"",null,"",null,""]
[448,448,"Gaitor, Anthony TBB CB",22.75,5.6879999999999997,null,null,null,null,"B",null,null,null,null,null,null,null,null,9.25,7,5,1.5,"Free Agent",5,null,null,"Gaitor, Anthony TBB CB",null,null,null,null,null,null,null,null,null,null,null,null,null,"",null,"",null,"",null,"",null,"",null,""]
[449,449,"Galette, Junior NOS DE",62.03,5.1689999999999996,4,0.83,18.7,0,9.8000000000000007,"B",13.5,3.75,0,null,null,null,null,0,2.25,7.7,1.5,"Free Agent (P)",6,null,null,{"$f":"IF(ISBLANK(C459),\"\",C459)","v":"Galette, Junior NOS DE"},null,null,null,null,null,null,null,null,null,null,null,null,null,"",null,"",null,"",null,"",null,"",null,""]
[450,450,"Gallarda, Tommy ATL TE",2.2000000000000002,0.24399999999999999,0,0,0,0,2.2000000000000002,0,"B",0,0,0,null,null,null,null,null,null,null,"Free Agent",7,null,null,"Gallarda, Tommy ATL TE",null,null,null,null,null,null,null,null,null,null,null,null,null,"",null,"",null,"",null,"",null,"",null,""]
[451,451,"Gamble, Chris CAR CB",22.25,5.5620000000000003,2.5,10.75,5.25,3.75,null,"B",null,null,null,null,null,null,null,null,null,null,null,"Free Agent",6,null,null,"Gamble, Chris CAR CB",null,null,null,null,null,null,null,null,null,null,null,null,null,"",null,"",null,"",null,"",null,"",null,""]
[452,452,"Ganaway, Terrance STL RB",0,0,null,null,null,0,null,null,null,0,"B",0,null,null,null,null,null,null,null,"Free Agent (P)",9,null,null,"Ganaway, Terrance STL RB",null,null,null,null,null,null,null,null,null,null,null,null,null,"",null,"",null,"",null,"",null,"",null,""]
[453,453,"Gano, Graham CAR PK",48.5,8.0830000000000002,null,null,null,null,null,"B",null,null,null,null,null,5,3,12.5,7,6.5,14.5,"Free Agent",6,null,null,"Gano, Graham CAR PK",null,null,null,null,null,null,null,null,null,null,null,null,null,"",null,"",null,"",null,"",null,"",null,""]
[454,454,"Garay, Antonio SDC DT",35.549999999999997,4.444,null,null,null,null,null,null,"B",null,2.5,0,1.25,2.5,3.75,null,18.05,3.75,3.75,"Free Agent",7,null,null,"Garay, Antonio SDC DT",null,null,null,null,null,null,null,null,null,null,null,null,null,"",null,"",null,"",null,"",null,"",null,""]
[455,455,"Garcon, Pierre WAS WR",153.19999999999999,15.32,22.9,null,null,10.25,6.15,null,null,null,null,"B",4.25,21.3,26.6,20.75,15,17.649999999999999,8.35,"Derek's Daycare (P)",10,null,null,"Garcon, Pierre WAS WR",null,null,null,null,null,null,null,null,null,null,null,null,null,"",null,"",null,"",null,"",null,"",null,""]
[456,456,"Gates, Antonio SDC TE",170.3,11.353,10.3,null,6.7,10.4,6.4,29.1,"B",4.4000000000000004,14.8,17.7,4.7,4.3,14.9,7.6,15.1,13.4,10.5,"BELAC",7,null,null,"Gates, Antonio SDC TE",null,null,null,null,null,null,null,null,null,null,null,null,null,"",null,"",null,"",null,"",null,"",null,""]
[457,457,"Gates, Clyde NYJ WR",50.36,4.5780000000000003,null,2.25,0,0,3.95,null,null,19.47,"B",5.49,3.45,4.5,null,null,0,11.25,0,"Free Agent (P)",9,null,null,"Gates, Clyde NYJ WR",null,null,null,null,null,null,null,null,null,null,null,null,null,"",null,"",null,"",null,"",null,"",null,""]
[458,458,"Gay, William ARI CB",122.6,7.6619999999999999,16,6,7.5,3.75,0,9.5,3,7.5,8.1,"B",18.100000000000001,3,16.149999999999999,1.5,9.25,4,9.25,"Free Agent",10,null,null,"Gay, William ARI CB",null,null,null,null,null,null,null,null,null,null,null,null,null,"",null,"",null,"",null,"",null,"",null,""]
[459,459,"Geathers, Clifton IND DE",17.399999999999999,2.1749999999999998,null,null,null,"B",null,2.5,4.25,0,null,null,1.25,null,0,0,null,0,9.4,"Free Agent",4,null,null,"Geathers, Clifton IND DE",null,null,null,null,null,null,null,null,null,null,null,null,null,"",null,"",null,"",null,"",null,"",null,""]
[460,460,"Geathers, Robert CIN DE",73.5,4.5940000000000003,0,0,3.75,6.25,2.5,13.65,6.95,"B",5,14.9,0,9.25,0,1.25,5,3.75,1.25,"Free Agent",8,null,null,"Geathers, Robert CIN DE",null,null,null,null,null,null,null,null,null,null,null,null,null,"",null,"",null,"",null,"",null,"",null,""]
[461,461,"Gerhart, Toby MIN RB",52.4,3.2749999999999999,3.6,5.2,-0.2,2.6,4.0999999999999996,3.1,0.1,4.5999999999999996,2.7,3.5,"B",0,1.9,2.6,3.6,10.6,4.4000000000000004,"Free Agent",11,null,null,"Gerhart, Toby MIN RB",null,null,null,null,null,null,null,null,null,null,null,null,null,"",null,"",null,"",null,"",null,"",null,""]
[462,462,"Gettis, David CAR WR",0,0,null,null,null,null,null,"B",null,null,null,0,null,null,null,0,null,null,null,"Free Agent",6,null,null,"Gettis, David CAR WR",null,null,null,null,null,null,null,null,null,null,null,null,null,"",null,"",null,"",null,"",null,"",null,""]
[463,463,"Gibson, Brandon STL WR",162.85,10.178000000000001,16.100000000000001,13.8,4.4000000000000004,5.3,7.05,17.850000000000001,12.25,8.35,"B",8.4499999999999993,16.649999999999999,0,0,23.5,15.1,5.8,8.25,"Free Agent",9,null,null,"Gibson, Brandon STL WR",null,null,null,null,null,null,null,null,null,null,null,null,null,"",null,"",null,"",null,"",null,"",null,""]
[464,464,"Gibson, Gary TBB DT",46.5,2.9060000000000001,0,3.75,2,2.5,"B",10.25,0,0,0,1.75,0,5,9.5,2.5,0,4.25,5,"Free Agent",5,null,null,"Gibson, Gary TBB DT",null,null,null,null,null,null,null,null,null,null,null,null,null,"",null,"",null,"",null,"",null,"",null,""]
[465,465,"Gilberry, Wallace CIN DE",108.55,7.7539999999999996,null,null,1.25,5,1.25,9.4,2,"B",1.25,15.55,7.5,13.25,9.9499999999999993,1.25,19.3,7.35,14.25,"Free Agent",8,null,null,"Gilberry, Wallace CIN DE",null,null,null,null,null,null,null,null,null,null,null,null,null,"",null,"",null,"",null,"",null,"",null,""]
[466,466,"Gilchrist, Marcus SDC CB",90.45,5.6529999999999996,4.75,1.5,5.25,3,7,6,"B",0.75,7.5,3,11.75,4.75,11.25,13.45,2.25,3,5.25,"Free Agent",7,null,null,"Gilchrist, Marcus SDC CB",null,null,null,null,null,null,null,null,null,null,null,null,null,"",null,"",null,"",null,"",null,"",null,""]
[467,467,"Gilmore, Stephon BUF CB",142.05000000000001,8.8780000000000001,9,18,1.5,19,9.25,9.25,4,"B",7,8.25,7.5,17.25,6.25,15.3,1.5,6,3,"Klingon Warriors",8,null,null,"Gilmore, Stephon BUF CB",null,null,null,null,null,null,null,null,null,null,null,null,null,"",null,"",null,"",null,"",null,"",null,""]
[468,468,"Gilreath, David PIT WR",1.23,0.41,null,null,null,"B",null,null,null,null,null,0.53,0.7,0,null,null,null,null,null,"Free Agent",4,null,null,"Gilreath, David PIT WR",null,null,null,null,null,null,null,null,null,null,null,null,null,"",null,"",null,"",null,"",null,"",null,""]
[469,469,"Gilyard, Mardy FA WR",5,0.625,null,0,0,0,0,1,null,0,null,null,null,null,null,4,0,null,null,"Free Agent","-",null,null,"Gilyard, Mardy FA WR",null,null,null,null,null,null,null,null,null,null,null,null,null,"",null,"",null,"",null,"",null,"",null,""]
[470,470,"Ginn Jr., Ted SFO WR",24.17,1.859,null,null,null,0.37,1.27,1.47,6.31,6.42,"B",3.25,3.79,-2.13,1.75,0.8,-1,0,1.87,"Free Agent",9,null,null,"Ginn Jr., Ted SFO WR",null,null,null,null,null,null,null,null,null,null,null,null,null,"",null,"",null,"",null,"",null,"",null,""]
[471,471,"Giordano, Matt OAK S",90,5.625,0,0,7.5,12,"B",4.5,1.5,12.6,3.75,4.5,5.25,9.25,11.4,6,1.5,4.75,5.5,"Free Agent",5,null,null,"Giordano, Matt OAK S",null,null,null,null,null,null,null,null,null,null,null,null,null,"",null,"",null,"",null,"",null,"",null,""]
[472,472,"Gipson, Tashaun CLE S",48.8,4.88,0,0,5.25,2.25,null,null,null,null,null,"B",2.25,3,11.25,12.05,4.5,null,8.25,"Free Agent",10,null,null,"Gipson, Tashaun CLE S",null,null,null,null,null,null,null,null,null,null,null,null,null,"",null,"",null,"",null,"",null,"",null,""]
[473,473,"Givens, Chris STL WR",170.06,11.337,0,0,3.4,7.37,14.79,14.05,15.45,18.97,"B",null,11.98,25.09,23.83,11.47,4.6100000000000003,9.11,9.94,"Aaron Hernandez's Pistol Offense",9,null,null,"Givens, Chris STL WR",null,null,null,null,null,null,null,null,null,null,null,null,null,"",null,"",null,"",null,"",null,"",null,""]
[474,474,"Godfrey, Charles CAR S",121.15,8.077,9,27.15,10.5,9.25,3,"B",6.75,2.25,7.75,10.25,10,2.5,4.5,null,0.75,4.75,12.75,"Free Agent",6,null,null,"Godfrey, Charles CAR S",null,null,null,null,null,null,null,null,null,null,null,null,null,"",null,"",null,"",null,"",null,"",null,""]
[475,475,"Goethel, Travis OAK LB",0,0,0,0,0,0,"B",0,0,null,0,0,null,null,null,null,null,null,null,"Free Agent",5,null,null,"Goethel, Travis OAK LB",null,null,null,null,null,null,null,null,null,null,null,null,null,"",null,"",null,"",null,"",null,"",null,""]
[476,476,"Golden, Robert PIT S",7.5,0.5,0,0,0,"B",null,0,0,0,0,0,0,0,0,1.5,4.5,0,1.5,"Free Agent",4,null,null,"Golden, Robert PIT S",null,null,null,null,null,null,null,null,null,null,null,null,null,"",null,"",null,"",null,"",null,"",null,""]
[477,477,"Goldson, Dashon SFO S",142.1,8.8810000000000002,5.25,17.75,3.75,11.75,7,12,14.35,9.25,"B",12.25,9,6.75,7.75,7.5,8.5,6.25,3,"Free Agent",9,null,null,"Goldson, Dashon SFO S",null,null,null,null,null,null,null,null,null,null,null,null,null,"",null,"",null,"",null,"",null,"",null,""]
[478,478,"Golston, Kedric WAS DE",32.5,2.0310000000000001,0,0,1.25,0,2.5,0,1.25,0,3.5,"B",9.75,0,8,3.75,0,0,2.5,"Free Agent",10,null,null,"Golston, Kedric WAS DE",null,null,null,null,null,null,null,null,null,null,null,null,null,"",null,"",null,"",null,"",null,"",null,""]
[479,479,"Gomes, Dejon WAS S",61.4,4.093,17.649999999999999,13,3,0,5.25,0,0,0,0,"B",7.25,10.75,3,0.75,0,0.75,null,"Free Agent",10,null,null,"Gomes, Dejon WAS S",null,null,null,null,null,null,null,null,null,null,null,null,null,"",null,"",null,"",null,"",null,"",null,""]
[480,480,"Gonzalez, Tony ATL TE",280.5,17.530999999999999,18.8,23.5,28.6,12.6,37.799999999999997,10.199999999999999,"B",7.4,9.6,40.700000000000003,7.8,13.7,17.8,18.100000000000001,19.899999999999999,2.4,11.6,"Roddy White Man Can't Jump",7,null,null,"Gonzalez, Tony ATL TE",null,null,null,null,null,null,null,null,null,null,null,null,null,"",null,"",null,"",null,"",null,"",null,""]
[481,481,"Goode, Najee TBB LB",0,0,null,null,0,null,"B",null,null,null,null,null,null,null,null,null,null,0,0,"Free Agent",5,null,null,"Goode, Najee TBB LB",null,null,null,null,null,null,null,null,null,null,null,null,null,"",null,"",null,"",null,"",null,"",null,""]
[482,482,"Gooden, Tavares SFO LB",1.5,0.1,0,0,0,1.5,0,0,0,0,"B",0,0,0,0,0,null,0,0,"Free Agent",9,null,null,"Gooden, Tavares SFO LB",null,null,null,null,null,null,null,null,null,null,null,null,null,"",null,"",null,"",null,"",null,"",null,""]
[483,483,"Goodman, Richard SDC WR",19.88,2.84,3.04,2.96,1.24,2.12,5.08,4.5999999999999996,"B",0.84,null,null,null,null,null,null,null,null,null,"Free Agent",7,null,null,"Goodman, Richard SDC WR",null,null,null,null,null,null,null,null,null,null,null,null,null,"",null,"",null,"",null,"",null,"",null,""]
[484,484,"Goodson, Mike OAK RB",80.959999999999994,6.7469999999999999,1.3,19.34,2.14,4.7,"B",12.6,5.56,4.04,12.08,null,null,null,null,1.36,12.3,4.04,1.5,"Free Agent (O)",5,null,null,"Goodson, Mike OAK RB",null,null,null,null,null,null,null,null,null,null,null,null,null,"",null,"",null,"",null,"",null,"",null,""]
[485,485,"Gordon, Josh CLE WR",173,10.811999999999999,5.7,1.75,7.75,2.85,23.7,20.65,14.4,8.35,6.3,"B",11.55,11,26.1,18.600000000000001,6.45,1.95,5.9,"Hurry Up and Happy Birthday, Donny (S)",10,null,null,"Gordon, Josh CLE WR",null,null,null,null,null,null,null,null,null,null,null,null,null,"",null,"",null,"",null,"",null,"",null,""]
[486,486,"Gordon, Richard OAK TE",9.9,0.76200000000000001,0,0,7.6,null,"B",null,null,0,2.2999999999999998,0,0,0,0,0,0,0,0,"Free Agent",5,null,null,"Gordon, Richard OAK TE",null,null,null,null,null,null,null,null,null,null,null,null,null,"",null,"",null,"",null,"",null,"",null,""]
[487,487,"Gordy, Josh IND CB",27.65,1.843,0,0,null,"B",3.75,1.5,1.5,0.75,0,13.4,5.25,1.5,0,0,0,0,0,"Free Agent",4,null,null,"Gordy, Josh IND CB",null,null,null,null,null,null,null,null,null,null,null,null,null,"",null,"",null,"",null,"",null,"",null,""]
[488,488,"Gore, Frank SFO RB",233.1,14.569000000000001,18.3,18.5,5.2,15.5,16.600000000000001,9.6,23.2,7.6,"B",22.7,7.8,18.100000000000001,11.8,16.5,22,1.8,17.899999999999999,"Roddy White Man Can't Jump (P)",9,null,null,"Gore, Frank SFO RB",null,null,null,null,null,null,null,null,null,null,null,null,null,"",null,"",null,"",null,"",null,"",null,""]
[489,489,"Gostkowski, Stephen NEP PK",156.5,9.7810000000000006,10,14.5,12.5,9,7,11,10,9,"B",14,10,6,11.5,6,10.5,11.5,4,"BELAC",9,null,null,"Gostkowski, Stephen NEP PK",null,null,null,null,null,null,null,null,null,null,null,null,null,"",null,"",null,"",null,"",null,"",null,""]
[490,490,"Gould, Robbie CHI PK",98.5,7.577,11,4.5,12.5,10.5,11,"B",7,2.5,15.5,7.5,1,8,5.5,2,null,null,null,"Free Agent",6,null,null,"Gould, Robbie CHI PK",null,null,null,null,null,null,null,null,null,null,null,null,null,"",null,"",null,"",null,"",null,"",null,""]
[491,491,"Gradkowski, Bruce CIN QB",3.9,1.3,-0.5,null,null,null,null,null,null,"B",null,null,null,null,null,null,null,0,4.4000000000000004,"Free Agent",8,null,null,"Gradkowski, Bruce CIN QB"]
[492,492,"Graham, Brandon PHI DE",101,6.3120000000000003,1.5,1.5,11.55,0,0.75,1.5,"B",6,14.55,0,0,1.5,17.2,3,26.7,12.25,3,"Free Agent",7,null,null,"Graham, Brandon PHI DE"]
[493,493,"Graham, Corey BAL S",103.78,6.4859999999999998,2.25,0,0,0,0,1.5,3,"B",7.5,3,23.5,11,22.5,8.25,13.25,5.78,2.25,"Free Agent",8,null,null,"Graham, Corey BAL S"]
[494,494,"Graham, Daniel FA TE",0,0,0,0,0,0,0,null,0,null,null,null,null,null,null,null,null,null,null,"Free Agent","-",null,null,"Graham, Daniel FA TE"]
[495,495,"Graham, Garrett HOU TE",86.3,5.7530000000000001,0,3,6.9,0,0,7,6.2,"B",10.1,6,32.200000000000003,6.2,2.2000000000000002,null,0,4.4000000000000004,2.1,"Free Agent",8,null,null,"Graham, Garrett HOU TE"]
[496,496,"Graham, Jimmy NOS TE",280.7,18.713000000000001,23.5,23.6,13.6,18.100000000000001,1.9,"B",null,19.8,25.2,39.1,15.9,9.3000000000000007,11.9,13.1,14.4,20.3,31,"Angry Neighbors (P)",6,null,null,"Graham, Jimmy NOS TE"]
[497,497,"Graham, Shayne HOU PK",147.5,9.2189999999999994,12.5,9,7.5,8,11.5,7.5,11,"B",3,7.5,13.5,10.5,7.5,2,17.5,7.5,11.5,"Free Agent",8,null,null,"Graham, Shayne HOU PK"]
[498,498,"Graham, T.J. BUF WR",79.45,5.2969999999999997,null,1.95,12.15,8.4,5.3,1.85,1.85,"B",2.9,2.35,3,4.9000000000000004,8.9,7.55,6.95,9.65,1.75,"Free Agent (P)",8,null,null,"Graham, T.J. BUF WR"]
[499,499,"Grant, Larry SFO LB",4.25,0.26600000000000001,0,0,0.75,2,1.5,0,0,0,"B",0,0,0,0,0,0,0,0,"Free Agent",9,null,null,"Grant, Larry SFO LB"]
[500,500,"Grant, Ryan GBP RB",26.6,5.32,null,null,null,null,0.5,null,null,null,null,"B",null,null,null,1.3,0.2,24.4,0.2,"Free Agent",10,null,null,"Grant, Ryan GBP RB"]
[501,501,"Gray, Cyrus KCC RB",9.52,0.95199999999999996,null,null,0,2.82,4.2,0,"B",0,0,null,null,null,1.6,0,null,0,0.9,"Free Agent",7,null,null,"Gray, Cyrus KCC RB"]
[502,502,"Green, A.J. CIN WR",331.71,20.731999999999999,13.25,20.55,41.31,26.2,21.75,35.25,8.0500000000000007,"B",25.25,24.25,23.6,18.95,19.75,8.15,19.2,21.1,5.0999999999999996,"Klingon Warriors (P)",8,null,null,"Green, A.J. CIN WR"]
[503,503,"Green, Alex GBP RB",76.900000000000006,6.4080000000000004,null,0.2,null,0,7.3,8.3000000000000007,10.4,12.2,9.8000000000000007,"B",0,8,8,6.6,6.1,null,null,"Free Agent (P)",10,null,null,"Green, Alex GBP RB"]
[504,504,"Green, Jonte DET CB",62.5,4.1669999999999998,0,0,0,0,"B",2.5,11.45,2.5,16.8,2.25,2.25,0,null,1.5,9.75,13.5,0,"Free Agent",5,null,null,"Green, Jonte DET CB"]
[505,505,"Green, Ladarius SDC TE",11.6,3.867,null,4.5999999999999996,null,null,null,null,"B",null,null,null,7,0,null,null,null,null,null,"The Black Champion",7,null,null,"Green, Ladarius SDC TE"]
[506,506,"Green, Virgil DEN TE",13.8,1.1499999999999999,null,null,null,null,0,0,"B",8.9,0,0,0,0,0,0,0,0,4.9000000000000004,"Free Agent",7,null,null,"Green, Virgil DEN TE"]
[507,507,"Green-Ellis, BenJarvus CIN RB",173.8,10.862,16.5,13.5,6.8,8.4,2.6,8,6.9,"B",13.3,7.8,17.8,21.8,18.2,13.2,16.600000000000001,2.4,0,"Angry Neighbors",8,null,null,"Green-Ellis, BenJarvus CIN RB"]
[508,508,"Greene, Shonn NYJ RB",188.62,11.789,15.4,2.2999999999999998,6.9,3.4,5.5,37.32,20.8,12.6,"B",7.3,6.4,6,10.4,13.7,8.9,22,9.6999999999999993,"Roddy White Man Can't Jump",9,null,null,"Greene, Shonn NYJ RB"]
[509,509,"Greenway, Chad MIN LB",228.2,14.263,21.5,8.75,29.85,13.5,15,7.5,10,14,13.25,13.8,"B",13,21.75,3.5,30.55,7.75,4.5,"BELAC",11,null,null,"Greenway, Chad MIN LB"]
[510,510,"Greer, Jabari NOS CB",116.85,8.3460000000000001,null,1.5,20.3,9,2.5,"B",7,6.25,10,7.75,5,6,4.5,10,25.55,1.5,null,"Free Agent",6,null,null,"Greer, Jabari NOS CB"]
[511,511,"Gregory, Steve NEP S",100.5,8.375,2.25,6.75,17.100000000000001,6,null,null,null,null,"B",6,6.25,27.6,0,6,7.75,4.5,10.3,"Free Agent",9,null,null,"Gregory, Steve NEP S"]
[512,512,"Gresham, Jermaine CIN TE",198.7,12.419,7.5,9.6999999999999993,19.899999999999999,12.2,13.5,19.3,6.4,"B",21.8,12,13.9,16.100000000000001,12.5,10.3,15.3,8.3000000000000007,0,"Roddy White Man Can't Jump (P)",8,null,null,"Gresham, Jermaine CIN TE"]
[513,513,"Griffen, Everson MIN DE",138.35,8.6470000000000002,0,10.7,9.25,22.1,0,2.5,0,0,1.25,14.5,"B",0,8.75,11.4,19.899999999999999,8,30,"Free Agent",11,null,null,{"$f":"IF(ISBLANK(C523),\"\",C523)","v":"Griffen, Everson MIN DE"}]
[514,514,"Griffin III, Robert WAS QB",313.23,20.882000000000001,29.2,30.44,18.34,23.75,2.34,37.840000000000003,20.22,11.18,9.9,"B",35.4,34.1,18.72,13.18,null,13.32,15.3,"Roddy White Man Can't Jump (Q)",10,null,null,"Griffin III, Robert WAS QB"]
[515,515,"Griffin, Cedric WAS CB",58,6.444,12.5,8.5,0,null,null,null,9.25,6.5,1.5,"B",4.5,8.5,6.75,null,null,null,null,"Free Agent",10,null,null,"Griffin, Cedric WAS CB"]
[516,516,"Griffin, Michael TEN S",155.44999999999999,9.7159999999999993,4.5,29,9,1.5,4.25,4.5,9,23,1.5,3,"B",15.8,4.5,4.75,25.85,3,12.3,"Free Agent",11,null,null,"Griffin, Michael TEN S"]
[517,517,"Grimes, Brent ATL CB",9,9,9,null,null,null,null,null,"B",null,null,null,null,null,null,null,null,null,null,"Free Agent",7,null,null,"Grimes, Brent ATL CB"]
[518,518,"Grimes, Jonathan JAC RB",3.3,0.36699999999999999,null,null,null,null,0,"B",1.4,1.9,0,0,0,0,0,0,null,null,null,"Free Agent",6,null,null,"Grimes, Jonathan JAC RB"]
[519,519,"Grimm, Cody TBB S",0,0,0,0,0,0,"B",0,0,0,0,null,0,null,null,null,null,null,null,"Free Agent",5,null,null,"Grimm, Cody TBB S"]
[520,520,"Gronkowski, Chris DEN RB",2.1,0.15,0,0,2.1,0,0,0,"B",0,0,0,0,0,0,0,0,null,null,"Free Agent",7,null,null,"Gronkowski, Chris DEN RB"]
[521,521,"Gronkowski, Rob NEP TE",226.5,20.591000000000001,21,22.5,5.0999999999999996,22.9,9.5,15.1,28.8,38.6,"B",13.6,36.200000000000003,null,null,null,null,null,13.2,"Hurry Up and Happy Birthday, Donny (O)",9,null,null,"Gronkowski, Rob NEP TE"]
[522,522,"Groves, Quentin ARI LB",88.15,5.5090000000000003,1.5,10.199999999999999,9.3000000000000007,1.5,0,0,3,4.5,4.75,"B",6.75,17.45,8.25,16.45,1.5,0,3,"Free Agent",10,null,null,"Groves, Quentin ARI LB"]
[523,523,"Guion, Letroy MIN DT",76.95,5.13,3.75,1.25,8.25,17.7,3.75,11,7.5,2.5,5,null,"B",3.75,1.25,1.25,5,0,5,"Free Agent (Q)",11,null,null,"Guion, Letroy MIN DT"]
[524,524,"Guy, Lawrence IND DE",44.3,4.9219999999999997,null,null,null,"B",null,null,2.5,null,null,0,2.5,1.25,6.25,3.75,0,16.25,11.8,"Free Agent",4,null,null,"Guy, Lawrence IND DE"]
[525,525,"Guyton, Gary SDC LB",1.5,1.5,null,null,null,null,null,null,"B",null,null,null,null,null,null,null,1.5,null,null,"Free Agent",7,null,null,"Guyton, Gary SDC LB"]
[526,526,"Haden, Joe CLE CB",117.65,10.695,20.75,null,null,null,null,23.65,3,9.75,7.75,"B",null,16.75,8.5,5.25,9.5,5.25,7.5,"Angry Neighbors",10,null,null,"Haden, Joe CLE CB"]
[527,527,"Hagan, Derek OAK WR",50.9,3.6360000000000001,9.4,2.25,6.75,4.3,"B",13.5,0,0,1.85,4.9000000000000004,2.95,0,1.85,null,null,3.15,0,"Free Agent",5,null,null,"Hagan, Derek OAK WR"]
[528,528,"Hagg, Eric CLE S",34.32,3.12,4.75,5.25,null,null,0,null,0,0,0,"B",4.62,1.7,10.5,null,null,1.5,6,"Free Agent",10,null,null,"Hagg, Eric CLE S"]
[529,529,"Haggan, Mario STL LB",24.9,2.2639999999999998,0,1.5,0,2.25,0,null,null,null,"B",18.899999999999999,0,null,null,0,1.5,0,0.75,"Free Agent",9,null,null,"Haggan, Mario STL LB"]
[530,530,"Haggans, Clark SFO LB",3,0.375,null,null,null,null,null,null,0,1.5,"B",0,1.5,0,0,null,0,null,0,"Free Agent",9,null,null,"Haggans, Clark SFO LB"]
[531,531,"Hali, Tamba KCC LB",140.19999999999999,9.3469999999999995,null,5.25,0,15.5,21.9,13,"B",3,17.649999999999999,4.75,13.35,4.5,4.5,20.3,4,9.5,3,"Free Agent",7,null,null,"Hali, Tamba KCC LB"]
[532,532,"Hall, Deangelo WAS CB",193.62,12.101000000000001,11.45,18,17.25,18.8,10.25,15,7,8.25,9.25,"B",20.45,18.170000000000002,5.25,8.25,7.5,7.5,11.25,"Free Agent (P)",10,null,null,"Hall, Deangelo WAS CB"]
[533,533,"Hall, Leon CIN CB",95.6,6.8289999999999997,11,10.25,null,null,5.25,3.75,7,"B",6.75,4.5,1.5,7.25,1.5,4.5,13.4,15.2,3.75,"Free Agent",8,null,null,"Hall, Leon CIN CB"]
[534,534,"Hampton, Casey PIT DT",51.25,3.2029999999999998,3.75,5,1.25,"B",0,0,3.5,1.25,3.5,6.25,7.25,3.75,0,5.5,0,9,1.25,"Free Agent",4,null,null,"Hampton, Casey PIT DT"]
[535,535,"Hankerson, Leonard WAS WR",122.3,7.6440000000000001,0,16.3,10.6,14.45,1.75,4.8,14.5,2.85,8.65,"B",5.5,2.4500000000000002,2.65,12,21.1,2.25,2.4500000000000002,"Derek's Daycare ",10,null,null,"Hankerson, Leonard WAS WR"]
[536,536,"Hanna, James DAL TE",21.6,1.35,2.5,0,0,0,"B",0,0,0,0,0,0,0,0,1.8,7.5,3.3,6.5,"Free Agent",5,null,null,"Hanna, James DAL TE"]
[537,537,"Hanson, Jason DET PK",144,9,10,13.5,17,7.5,"B",15,1,4,7.5,6.5,8,7.5,17,8.5,4.5,10,6.5,"Free Agent",5,null,null,"Hanson, Jason DET PK"]
[538,538,"Hanson, Joselio OAK CB",115.9,7.2439999999999998,0,9,13.25,6,"B",15.85,7.25,4.5,0,3,6,7,7.5,12.75,10.8,7.75,5.25,"Free Agent",5,null,null,"Hanson, Joselio OAK CB"]
[539,539,"Harbor, Clay PHI TE",65.099999999999994,4.6500000000000004,12.1,3.4,0,2.2000000000000002,2.2999999999999998,3.9,"B",0,6.5,7,1.4,0,1.8,20.2,4.3,null,null,"Free Agent",7,null,null,"Harbor, Clay PHI TE"]
[540,540,"Hardesty, Montario CLE RB",36.700000000000003,3.0579999999999998,0,0,null,null,null,13.5,2.8,0.3,null,"B",2.2999999999999998,1.4,3.9,5.2,0.5,3.1,3.7,"Free Agent (O)",10,null,null,"Hardesty, Montario CLE RB"]
[541,541,"Hardy, Greg CAR DE",219,14.6,16,7.5,0,9.1,20,"B",3.75,33,23.95,16.25,9.85,18.45,13.5,12.95,29.7,5,null,"Derek's Daycare ",6,null,null,"Hardy, Greg CAR DE"]
[542,542,"Harper, Jamie TEN RB",22.8,2.2799999999999998,2.1,null,0,null,null,6.1,12.8,-0.1,0,0,"B",null,null,0,0,1.9,null,"Free Agent",11,null,null,"Harper, Jamie TEN RB"]
[543,543,"Harper, Roman NOS S",200.85,12.553000000000001,12.5,3.75,20.75,13.5,25.85,"B",7.5,17.75,6.75,14.75,24,7.75,7.5,9.75,15,2.25,11.5,"Polk High (O)",6,null,null,"Harper, Roman NOS S"]
[544,544,"Harrell, Graham GBP QB",-3.1,-0.77500000000000002,null,null,null,-3.6,null,0,null,null,null,"B",null,0.44,null,null,null,0.06,null,"Free Agent",10,null,null,"Harrell, Graham GBP QB"]
[545,545,"Harris, Brandon HOU CB",22.5,2.8119999999999998,null,null,null,null,null,null,0,"B",null,0,null,0,13.25,2.25,3.25,3.75,0,"Free Agent",8,null,null,"Harris, Brandon HOU CB"]
[546,546,"Harris, Chris DEN CB",173.6,11.573,8.5500000000000007,null,8.5,11.6,8.25,31.6,"B",9.25,11,16.05,9.5,2.25,13.25,1.5,24.8,12,5.5,"Free Agent",7,null,null,"Harris, Chris DEN CB"]
[547,547,"Harris, Clark CIN TE",0,0,0,0,0,0,0,0,0,"B",0,0,0,0,0,0,0,0,0,"Free Agent",8,null,null,"Harris, Clark CIN TE"]
[548,548,"Harris, David NYJ LB",186.5,11.656000000000001,8.25,12.75,12.75,14.25,13,6.25,18.149999999999999,12,"B",10.75,6,13.5,10.15,20.7,7.5,14.5,6,"Derek's Daycare ",9,null,null,"Harris, David NYJ LB"]
[549,549,"Harris, DuJuan GBP RB",31.4,7.85,null,null,null,null,null,null,null,null,null,"B",null,null,null,9.1,2.7,8.9,10.7,"Free Agent",10,null,null,"Harris, DuJuan GBP RB"]
[550,550,"Harris, Dwayne DAL WR",86.45,5.4029999999999996,0.2,0,0,0,"B",0,0,0.93,2.4700000000000002,12.47,7.55,15.11,3.23,7.88,13.13,9.61,13.87,"Free Agent",5,null,null,"Harris, Dwayne DAL WR"]
[551,551,"Harris, Mike JAC CB",97.6,6.5069999999999997,null,0,1.5,0,0,"B",6.5,7.5,6,4.5,0,28.1,8.25,6.75,13,6.75,8.75,"Free Agent",6,null,null,"Harris, Mike JAC CB"]
[552,552,"Harrison, James PIT LB",140.85,10.835000000000001,null,null,null,"B",3,14.3,0,6,7.75,6,16.8,22.55,19.25,5.25,12,9,18.95,"Free Agent",4,null,null,"Harrison, James PIT LB"]
[553,553,"Hartley, Garrett NOS PK",114.5,7.1559999999999997,6,10.5,5.5,9,7,"B",5,2,4,7,8.5,3,8.5,9,11,9,9.5,"Free Agent",6,null,null,"Hartley, Garrett NOS PK"]
[554,554,"Hartline, Brian MIA WR",214.39,13.398999999999999,8.75,22.35,6.35,55.89,10.9,0,"B",9.1,20.7,17.899999999999999,6.9,4.2,14.65,5.9,13.95,3.7,13.15,"Hurry Up and Happy Birthday, Donny",7,null,null,"Hartline, Brian MIA WR"]
[555,555,"Hartman, Tysyn KCC S",38.75,3.875,null,2.5,0,0,0,null,"B",null,0,null,null,null,9,9.5,4,7,6.75,"Free Agent",7,null,null,"Hartman, Tysyn KCC S"]
[556,556,"Hartsock, Ben CAR TE",7,0.46700000000000003,0,null,0,1,0,"B",0,4,0,0,0,0,0,0,2,0,0,"Free Agent",6,null,null,"Hartsock, Ben CAR TE"]
[557,557,"Harvey, Mario IND LB",6.25,0.48099999999999998,4,0,0,"B",0,0,1.5,0,0.75,0,null,null,0,null,0,0,0,"Free Agent",4,null,null,"Harvey, Mario IND LB"]
[558,558,"Harvin, Percy MIN WR",204.76,22.751000000000001,21.42,29.82,25.01,17.350000000000001,34.6,29.15,17.579999999999998,25.37,4.46,null,"B",null,null,null,null,null,null,"Invictus (O)",11,null,null,"Harvin, Percy MIN WR"]
[559,559,"Hasselbeck, Matt TEN QB",63.08,7.8849999999999998,1.72,null,null,6.02,9,10.8,11,13.04,11.8,-0.3,"B",null,null,null,null,null,null,"Free Agent",11,null,null,"Hasselbeck, Matt TEN QB"]
[560,560,"Hatcher, Jason DAL DE",135.6,8.4749999999999996,17.75,6.25,2.5,3.75,"B",1.25,7.05,6.25,5,9.25,15.8,14.3,2.5,11.2,3.75,17.75,11.25,"Free Agent",5,null,null,"Hatcher, Jason DAL DE"]
[561,561,"Hauschka, Steven SEA PK",120,7.5,10.5,9,2,7,10.5,6,7.5,6,5.5,4,"B",3,5,16,13,6,9,"Free Agent",11,null,null,"Hauschka, Steven SEA PK"]
[562,562,"Havili, Stanley PHI RB",20.22,1.3480000000000001,0.72,1.5,0,3.2,0.5,0,"B",0,1.7,7.4,1.9,1.5,0,0,1.8,null,0,"Free Agent",7,null,null,"Havili, Stanley PHI RB"]
[563,563,"Hawk, A.J. GBP LB",175.45,10.965999999999999,18,5.25,12,3,10.75,19.2,6.75,6.75,5.25,"B",13.5,13.5,13.5,9,6.75,24.25,8,"Free Agent",10,null,null,"Hawk, A.J. GBP LB"]
[564,564,"Hawkins, Andrew CIN WR",143.05000000000001,10.218,18.600000000000001,15.1,17.7,7.65,11.45,9.9499999999999993,4.2,"B",8,11.35,null,null,7.95,17.899999999999999,0.9,6.75,5.55,"Free Agent (O)",8,null,null,"Hawkins, Andrew CIN WR"]
[565,565,"Hawkins, Lavelle TEN WR",21.65,3.093,3.3,5.2,null,1.75,null,null,null,1.95,null,null,"B",null,null,null,0,3,6.45,"Free Agent",11,null,null,"Hawkins, Lavelle TEN WR"]
[566,566,"Hawthorne, David NOS LB",50,4.5449999999999999,6.25,2.25,2.25,null,null,"B",null,null,null,6.25,2.25,5.25,4.5,7.75,3.25,4.5,5.5,"Free Agent",6,null,null,"Hawthorne, David NOS LB"]
[567,567,"Hayden, Kelvin CHI CB",75.650000000000006,4.7279999999999998,14,0,0,0,0,"B",1.5,0,7.25,3.75,1.5,10.25,5.5,3,7.5,18.399999999999999,3,"Free Agent (I)",6,null,null,"Hayden, Kelvin CHI CB"]
[568,568,"Hayes, Geno CHI LB",22.5,1.5,2.25,0,0,3,5.5,"B",0,0,0,0,0,0,0,4.5,null,3,4.25,"Free Agent",6,null,null,"Hayes, Geno CHI LB"]
[569,569,"Hayes, William STL DE",136.80000000000001,8.5500000000000007,0,5,8.5,11,8.3000000000000007,2.5,8.6999999999999993,3.5,"B",3.75,8.5,12,16.649999999999999,0,12,23.65,12.75,"Free Agent",9,null,null,"Hayes, William STL DE"]
[570,570,"Hayward, Adam TBB LB",29.75,1.859,0,2.5,0,0,"B",0,0,0,0,2.25,2.25,7.5,1.5,0.75,6,5.5,1.5,"Free Agent",5,null,null,"Hayward, Adam TBB LB"]
[571,571,"Hayward, Casey GBP CB",156.85,9.8030000000000008,0,3.75,4,9.25,9.75,21.2,12,10.5,17,"B",24.75,2.5,7.75,11,10.65,10.25,2.5,"Angry Neighbors (O)",10,null,null,"Hayward, Casey GBP CB"]
[572,572,"Heap, Todd FA TE",21.4,7.133,7.7,13.7,null,null,null,0,null,null,null,null,null,null,null,null,null,null,null,"Free Agent","-",null,null,"Heap, Todd FA TE"]
[573,573,"Heller, Will DET TE",46.5,2.9060000000000001,4.9000000000000004,2.2000000000000002,0,0,"B",0,0,0,0,0,3.2,0,2,8.1,4.8,9.4,11.9,"Free Agent",5,null,null,"Heller, Will DET TE"]
[574,574,"Helu, Roy WAS RB",11.7,3.9,5.7,1,5,null,null,null,null,null,null,"B",null,null,null,null,null,null,null,"Free Agent",10,null,null,"Helu, Roy WAS RB"]
[575,575,"Hemingway, Junior KCC WR",0,0,null,null,null,null,null,null,"B",null,null,null,null,null,null,null,null,null,0,"Free Agent",7,null,null,"Hemingway, Junior KCC WR"]
[576,576,"Henderson, Devery NOS WR",66.400000000000006,4.4269999999999996,2.35,null,10.3,2.25,27.3,"B",12.25,0,2.0499999999999998,0,1.55,1.85,0,2.35,1.3,0,2.85,"Free Agent",6,null,null,"Henderson, Devery NOS WR"]
[577,577,"Henderson, Erin MIN LB",130.44999999999999,9.3179999999999996,19.7,23.05,null,null,9.5,3.75,2.25,4.5,7.25,7,"B",15.25,9,5.25,9.6999999999999993,3.75,10.5,"I like my Women like I like my coffee, _______.",11,null,null,{"$f":"IF(ISBLANK(C587),\"\",C587)","v":"Henderson, Erin MIN LB"}]
[578,578,"Henery, Alex PHI PK",103.5,6.4690000000000003,4.5,6,6.5,13.5,2,11.5,"B",5,7,4.5,7,11,10,2,7,8,-2,"Free Agent",7,null,null,"Henery, Alex PHI PK"]
[579,579,"Henne, Chad JAC QB",95.98,9.5980000000000008,null,-2.2799999999999998,null,null,null,"B",0.24,null,null,5.84,40.4,11.44,10.58,-1.5,8.44,15.6,7.22,"Free Agent",6,null,null,"Henne, Chad JAC QB"]
[580,580,"Hernandez, Aaron NEP TE",155.80000000000001,15.58,20.9,0,null,null,null,18,12.9,null,"B",null,null,6.6,21.7,30.8,30.2,2.8,11.9,"Free Agent",9,null,null,"Hernandez, Aaron NEP TE"]
[581,581,"Herring, Will NOS LB",10.5,0.65600000000000003,7.5,0,0,1.5,0,"B",0,0,0,0,0,0,0,0,1.5,0,0,"Free Agent",6,null,null,"Herring, Will NOS LB"]
[582,582,"Herron, Dan CIN RB",0.5,0.16700000000000001,null,null,null,null,null,null,null,"B",null,null,null,null,null,0,0.8,null,-0.3,"Free Agent",8,null,null,"Herron, Dan CIN RB"]
[583,583,"Herzlich, Mark NYG LB",26.25,1.641,0,0,1.5,0,0,0,0,1.5,10.5,0,"B",0,3,0,0,9.75,0,"The Black Champion",11,null,null,"Herzlich, Mark NYG LB"]
[584,584,"Hester, Devin CHI WR",103.44,6.8959999999999999,8.2899999999999991,2.81,6.8,16.079999999999998,9.0500000000000007,"B",7.88,2.48,10.039999999999999,6.49,8.02,0.4,null,14.02,5.32,2.8,2.96,"Free Agent",6,null,null,"Hester, Devin CHI WR"]
[585,585,"Hester, Jacob DEN RB",21.8,7.2670000000000003,null,null,null,null,null,null,"B",null,null,null,null,null,null,null,8,6.6,7.2,"Free Agent",7,null,null,"Hester, Jacob DEN RB"]
[586,586,"Heyward, Cameron PIT DE",51.75,3.234,6.25,8.8000000000000007,0,"B",0,1.25,2.5,6.25,0,0,5,2.5,0,2.5,2.5,4.75,9.4499999999999993,"Free Agent",4,null,null,"Heyward, Cameron PIT DE"]
[587,587,"Heyward-Bey, Darrius OAK WR",148.44999999999999,9.8970000000000002,8.0500000000000007,9.1,9.9,null,"B",2,14.5,10.45,14.65,21.05,11.9,0,9,21.45,1,5.6,9.8000000000000007,"Roddy White Man Can't Jump",5,null,null,"Heyward-Bey, Darrius OAK WR"]
[588,588,"Hickman, Justin IND LB",13.25,1.1040000000000001,0,0,2.25,"B",2.5,2.25,1.5,0.75,0.75,0,0.75,0,2.5,null,null,null,null,"Free Agent",4,null,null,"Hickman, Justin IND LB"]
[589,589,"Hicks, Akiem NOS DT",45.5,3.25,null,1.75,13.75,1.25,2.5,"B",2.5,11.5,1.25,0,6,1.25,3.75,0,0,0,null,"Free Agent",6,null,null,"Hicks, Akiem NOS DT"]
[590,590,"Hightower, Dont'a NEP LB",126.85,9.0609999999999999,16.25,7,7.5,10,null,null,17.5,1.5,"B",3.75,4,11.85,3,9.25,13.25,16.5,5.5,"Free Agent",9,null,null,"Hightower, Dont'a NEP LB"]
[591,591,"Hill, Jason FA WR",10,3.3330000000000002,null,null,null,null,2.25,7.75,0,null,null,null,null,null,null,null,null,null,null,"Free Agent","-",null,null,"Hill, Jason FA WR"]
[592,592,"Hill, Leroy SEA LB",72.8,5.2,3.75,6,5.25,1.5,2.25,1.5,12,9.9,7.9,7.5,"B",7.75,null,0,3,4.5,null,"Free Agent",11,null,null,"Hill, Leroy SEA LB"]
[593,593,"Hill, Sammie Lee DET DT",39.5,2.633,5,0,2.5,1.75,"B",0,0,0,5,7.25,2.5,1.75,5,0,5,3.75,null,"Free Agent",5,null,null,"Hill, Sammie Lee DET DT"]
[594,594,"Hill, Shaun DET QB",17.78,17.78,null,null,17.78,null,"B",null,null,null,null,null,null,null,null,null,null,null,null,"Free Agent (P)",5,null,null,"Hill, Shaun DET QB"]
[595,595,"Hill, Stephen NYJ WR",69.45,6.3140000000000001,27.15,0,0,null,null,12.05,10.5,5.4,"B",0,0,4.0999999999999996,10.25,0,null,null,null,"Derek's Daycare ",9,null,null,"Hill, Stephen NYJ WR"]
[596,596,"Hill, Will NYG S",48,4,0,0,1.5,6.25,8,null,null,null,null,2.5,"B",2.25,0,9.25,12.25,3,3,"Free Agent (S)",11,null,null,"Hill, Will NYG S"]
[597,597,"Hilliard, Lex NYJ RB",12.3,0.879,0,0.2,null,null,1.7,0,3.2,1.5,"B",1.9,0.9,0,0,0,0,0,2.9,"Free Agent",9,null,null,"Hilliard, Lex NYJ RB"]
[598,598,"Hillis, Peyton KCC RB",47.1,3.6230000000000002,5.4,8.1,1.1000000000000001,null,null,null,"B",3.8,3.1,4.2,-2.1,0.5,9.8000000000000007,2.7,0,10.1,0.4,"Free Agent (P)",7,null,null,"Hillis, Peyton KCC RB"]
[599,599,"Hillman, Ronnie DEN RB",50.9,3.6360000000000001,null,null,1.8,8.3000000000000007,2.2999999999999998,0.3,"B",8.1999999999999993,1.9,9.3000000000000007,7.9,0.9,2.9,2.4,2.9,3.5,-1.7,"Roddy White Man Can't Jump",7,null,null,"Hillman, Ronnie DEN RB"]
[600,600,"Hilton, T.Y. IND WR",226.22,15.081,null,4.24,26.27,"B",8.32,6.85,5.23,10.62,25.73,3.8,30.89,26.45,18.899999999999999,8.9,19.75,5.9,24.37,"The Black Champion",4,null,null,"Hilton, T.Y. IND WR"]
[601,601,"Hixon, Domenik NYG WR",120.85,9.2959999999999994,9.58,2.4500000000000002,null,19.899999999999999,11.75,12.8,6.95,6.35,0,2.0499999999999998,"B",null,null,14.02,14.25,14.15,6.6,"Free Agent (P)",11,null,null,"Hixon, Domenik NYG WR"]
[602,602,"Hogue, Douglas CAR LB",0,0,0,0,0,0,null,"B",null,0,0,0,0,0,null,0,0,0,0,"Free Agent",6,null,null,"Hogue, Douglas CAR LB"]
[603,603,"Holliday, Trindon DEN WR",52.34,3.4889999999999999,2.81,4.45,1.27,4.51,1.52,-2.2000000000000002,"B",2.87,10.89,20.29,-0.81,3.68,7.37,-1.68,0,-2.63,null,"Free Agent",7,null,null,"Holliday, Trindon DEN WR"]
[604,604,"Holliday, Vonnie ARI DE",28,1.75,1.25,0,5,4.5,6.25,0,2.5,0,0,"B",1.25,0,0,4.75,0,1.25,1.25,"Free Agent",10,null,null,"Holliday, Vonnie ARI DE"]
[605,605,"Holmes, Andre NEP WR",3.6,0.51400000000000001,0,null,0,1.95,null,0,0,null,"B",0,null,1.65,null,null,null,null,null,"Free Agent (S)",9,null,null,"Holmes, Andre NEP WR"]
[606,606,"Holmes, Santonio NYJ WR",55.2,13.8,11.8,12.55,25.95,4.9000000000000004,null,null,null,null,"B",null,null,null,null,null,null,null,null,"Free Agent (O)",9,null,null,"Holmes, Santonio NYJ WR"]
[607,607,"Hood, Evander PIT DE",116.85,7.3029999999999999,5,2.5,2.5,"B",15.25,0,10,3.75,1.25,5.5,0,1.25,20.350000000000001,25.75,11.25,5,7.5,"Free Agent",4,null,null,"Hood, Evander PIT DE"]
[608,608,"Hoomanawanui, Michael NEP TE",20.399999999999999,1.4570000000000001,0,0,1.9,0,null,null,0,3.3,"B",0,0,0,0,0,7.6,7.6,0,"Free Agent",9,null,null,"Hoomanawanui, Michael NEP TE"]
[609,609,"Hope, Chris ATL S",22,1.375,0,0,0,0,0,0,"B",0,0,0,0,0,0,2.25,9.25,7.5,3,"Free Agent",7,null,null,"Hope, Chris ATL S"]
[610,610,"Hosley, Jayron NYG CB",71.5,5.9580000000000002,0.75,6.75,13,null,null,4.5,10,3.75,4.5,2.25,"B",5.5,null,3.25,8.25,9,null,"Free Agent",11,null,null,"Hosley, Jayron NYG CB"]
[611,611,"House, Davon GBP CB",52.3,5.8109999999999999,null,null,null,null,null,null,5.5,5.75,10,"B",13.3,8.5,5.5,3.75,0,0,null,"Free Agent",10,null,null,"House, Davon GBP CB"]
[612,612,"Housler, Robert ARI TE",109.2,7.28,0,2.2000000000000002,4.8,7.8,9,4.2,12.9,9.1999999999999993,13,"B",0,20.2,7.5,14.1,4.3,0,null,"Rancho Cucamonga Ghosts",10,null,null,"Housler, Robert ARI TE"]
[613,613,"Houston, Chris DET CB",120.95,8.6389999999999993,null,null,15.25,7,"B",10.5,9.25,15,8.5,3.75,5.25,21.2,8.25,1.5,1.5,6.75,7.25,"Free Agent",5,null,null,"Houston, Chris DET CB"]
[614,614,"Houston, Justin KCC LB",187.35,11.709,8.9499999999999993,7.75,32.75,4.5,19.3,14.45,"B",4.75,11.25,18.3,5.5,19.2,12.4,2.25,11.75,1.5,12.75,"The Black Champion",7,null,null,"Houston, Justin KCC LB"]
[615,615,"Houston, Lamarr OAK DE",192.35,12.022,5,7.5,11.25,15.5,"B",2.5,25.85,5,11,7.5,0,8.75,19.600000000000001,17.100000000000001,8.5,9.5,37.799999999999997,"Invictus",5,null,null,"Houston, Lamarr OAK DE"]
[616,616,"Howard, Jaye SEA DT",0,0,null,null,null,null,null,null,null,null,null,0,"B",null,null,null,null,null,0,"Free Agent",11,null,null,"Howard, Jaye SEA DT"]
[617,617,"Howard, Thomas CIN LB",13.6,13.6,13.6,null,null,null,null,null,null,"B",null,null,null,null,null,null,null,null,null,"Free Agent",8,null,null,"Howard, Thomas CIN LB"]
[618,618,"Hoyer, Brian ARI QB",9.8000000000000007,4.9000000000000004,null,null,null,null,null,null,null,null,null,"B",null,null,null,null,null,-0.8,10.6,"Free Agent",10,null,null,"Hoyer, Brian ARI QB"]
[619,619,"Huff, Michael OAK S",114.25,7.141,7.5,6,5.25,4.5,"B",18.75,10.5,1.5,5.25,18.75,6.5,6.75,5.25,3,4,7.75,3,"Free Agent",5,null,null,"Huff, Michael OAK S"]
[620,620,"Hughes, Jerry IND LB",103.55,6.4720000000000004,0,11.2,8.5,"B",0,20.85,6.5,8.6,1.25,11.9,5,2.5,0,5,8.75,11,2.5,"Free Agent",4,null,null,"Hughes, Jerry IND LB"]
[621,621,"Hughes, John CLE DT",88.7,5.5439999999999996,0,18.05,0,5,6.25,2.5,7.25,7.5,3.75,"B",9.1,2.5,2.5,13.05,5,6.25,0,"Free Agent",10,null,null,"Hughes, John CLE DT"]
[622,622,"Hughes, Robert IND RB",1.8,0.36,null,null,null,"B",null,null,null,null,0,1.3,0.5,0,null,0,null,null,null,"Free Agent",4,null,null,"Hughes, Robert IND RB"]
[623,623,"Hull, Josh STL LB",5.5,0.34399999999999997,0,0,0,0,0,0,0,5.5,"B",0,0,0,0,0,0,0,0,"Free Agent",9,null,null,"Hull, Josh STL LB"]
[624,624,"Humber, Ramon NOS LB",0,0,null,null,null,0,0,"B",0,0,0,0,0,0,0,0,0,0,0,"Free Agent",6,null,null,"Humber, Ramon NOS LB"]
[625,625,"Hunt, Phillip PHI DE",17.600000000000001,1.3540000000000001,0,0,1.5,0,1.5,0,"B",0,3,null,null,null,1.5,0,1.5,0,8.6,"Free Agent (O)",7,null,null,"Hunt, Phillip PHI DE"]
[626,626,"Hunter, Kendall SFO RB",66.7,6.0640000000000001,5.34,6.8,3.16,11.6,8.1,4.2,6.5,5.9,"B",3.3,9,2.8,null,null,null,null,null,"Angry Neighbors (Q)",9,null,null,"Hunter, Kendall SFO RB"]
[627,627,"Hynoski, Henry NYG RB",24,1.5,1.1000000000000001,1.8,3.5,1.4,0,0,1.3,0,1.8,0.5,"B",0,0,3.4,0,2.1,7.1,"Free Agent (P)",11,null,null,"Hynoski, Henry NYG RB"]
[628,628,"Idonije, Israel CHI DE",149.9,9.3689999999999998,3.5,6.25,27.75,5,3.75,"B",12.5,8.5,6.1,9,7.05,4.55,6.25,6.25,8.75,16.5,18.2,"Free Agent",6,null,null,"Idonije, Israel CHI DE"]
[629,629,"Ihedigbo, James BAL S",33.450000000000003,2.0910000000000002,2.25,4,0,0,0,0.75,0,"B",0,2.25,8.1999999999999993,0,0,0.75,7.5,5.25,2.5,"Free Agent (P)",8,null,null,"Ihedigbo, James BAL S"]
[630,630,"Ihenacho, Duke DEN S",0,0,null,null,null,null,null,null,"B",null,0,null,null,null,null,null,null,null,null,"Free Agent",7,null,null,"Ihenacho, Duke DEN S"]
[631,631,"Iloka, George CIN S",0,0,0,0,0,0,null,null,0,"B",null,0,0,null,null,null,null,null,null,"Free Agent",8,null,null,"Iloka, George CIN S"]
[632,632,"Ingram, Mark NOS RB",100.2,6.2629999999999999,1.5,11.3,1.1000000000000001,2,2.7,"B",2.1,0.7,8.6999999999999993,6.7,13.8,2.7,8.1999999999999993,6.8,15,13,3.9,"Angry Neighbors",6,null,null,"Ingram, Mark NOS RB"]
[633,633,"Ingram, Melvin SDC LB",58.71,3.669,4.5,3.25,4.75,6.5,0,3,"B",7.85,4.75,0,3.75,3,10.25,0.71,2.25,4.1500000000000004,0,"Free Agent (O)",7,null,null,"Ingram, Melvin SDC LB"]
[634,634,"Irvin, Bruce SEA DE",79.75,4.984,0,3.95,15.9,0,19.899999999999999,0.75,0,1.5,4.1500000000000004,16.5,"B",0.75,0,9.35,4,1.5,1.5,"Klingon Warriors (S)",11,null,null,"Irvin, Bruce SEA DE"]
[635,635,"Irving, Nate DEN LB",7.5,0.5,0,0,0,null,0,2.25,"B",2.5,0,0.75,2,0,0,0,0,0,0,"Free Agent",7,null,null,"Irving, Nate DEN LB"]
[636,636,"Ivory, Christopher NOS RB",38.200000000000003,6.367,null,null,null,null,null,"B",null,null,12,16.5,3.7,3.4,0.4,null,null,null,2.2000000000000002,"Klingon Warriors (P)",6,null,null,"Ivory, Christopher NOS RB"]
[637,637,"Jackson, Asa BAL CB",0,0,null,null,null,null,null,null,null,"B",null,null,null,0,0,0,null,null,null,"Free Agent (S)",8,null,null,"Jackson, Asa BAL CB"]
[638,638,"Jackson, Brandon CLE RB",9.4,4.7,4,null,null,null,null,null,null,null,null,"B",null,null,null,null,null,null,5.4,"Free Agent",10,null,null,"Jackson, Brandon CLE RB"]
[639,639,"Jackson, D'Qwell CLE LB",208,13,25.2,32.299999999999997,7.5,12,6,9,10.75,19.5,9,"B",8.25,17,6.75,11.25,11.25,10.75,11.5,"Angry Neighbors",10,null,null,"Jackson, D'Qwell CLE LB"]
[640,640,"Jackson, DeSean PHI WR",137.35,12.486000000000001,13.2,21.15,8.0500000000000007,23.4,8.8000000000000007,12.05,"B",12.15,20.75,12.45,3,2.35,null,null,null,null,null,"BELAC",7,null,null,"Jackson, DeSean PHI WR"]
[641,641,"Jackson, Fred BUF RB",110.4,11.04,1.5,null,null,7.9,4.4000000000000004,16.3,26,"B",8.5,23.5,null,3.4,13.9,5,null,null,null,"Aaron Hernandez's Pistol Offense (P)",8,null,null,{"$f":"IF(ISBLANK(C651),\"\",C651)","v":"Jackson, Fred BUF RB"}]
[642,642,"Jackson, Jerrell JAC WR",0,0,null,null,null,null,null,"B",null,null,null,null,null,null,null,null,null,null,0,"Free Agent",6,null,null,"Jackson, Jerrell JAC WR"]
[643,643,"Jackson, Kareem HOU CB",145.1,9.0690000000000008,17.05,0,13.75,25.3,9.4,3,3,"B",3,14.6,10,5.5,8,2.25,7,10.25,13,"Free Agent",8,null,null,"Jackson, Kareem HOU CB"]
[644,644,"Jackson, Lawrence DET DE",62.05,4.1369999999999996,0,0,null,3.75,"B",0,2,2.5,11.5,5,0,5.5,0,14.9,0,6.4,10.5,"Free Agent",5,null,null,"Jackson, Lawrence DET DE"]
[645,645,"Jackson, Malik DEN DE",10,0.71399999999999997,null,0,2.5,0,2.5,null,"B",0,0,2.5,0,0,0,0,0,1.25,1.25,"Free Agent",7,null,null,"Jackson, Malik DEN DE"]
[646,646,"Jackson, Rob WAS LB",132.85,8.3030000000000008,0,1.5,20,1.5,4.5,3.5,14.9,3,2.25,"B",10.45,3.75,9.6999999999999993,13.75,29.1,6.5,8.4499999999999993,"Free Agent (S)",10,null,null,"Jackson, Rob WAS LB"]
[647,647,"Jackson, Steven STL RB",203.08,12.692,12.4,5.8,5.4,7.7,7.6,12,11.7,6.5,"B",20.7,10.6,17.68,16.7,14.3,22.6,14.7,16.7,"BELAC",9,null,null,"Jackson, Steven STL RB"]
[648,648,"Jackson, Tarvaris BUF QB",0,0,null,null,null,null,null,0,null,"B",null,null,null,null,null,null,null,null,null,"Free Agent",8,null,null,"Jackson, Tarvaris BUF QB"]
[649,649,"Jackson, Tyson KCC DE",119.8,7.9870000000000001,7.5,7.5,7.5,1.25,2.5,6.25,"B",7.5,2.5,5,16.399999999999999,6.75,21.3,16.600000000000001,6.25,5,null,"Free Agent",7,null,null,"Jackson, Tyson KCC DE"]
[650,650,"Jackson, Vincent TBB WR",290.95999999999998,18.184999999999999,9.6999999999999993,26.05,4.1500000000000004,24.58,"B",23.6,43.83,6.5,17.899999999999999,12.15,24.9,15.85,9.25,27.6,15.6,20.55,8.75,"Roddy White Man Can't Jump",5,null,null,"Jackson, Vincent TBB WR"]
[651,651,"Jacobs, Brandon FA RB",0.7,0.35,null,null,null,null,null,null,null,null,null,null,null,0.1,0.6,null,null,null,null,"Free Agent","-",null,null,"Jacobs, Brandon FA RB"]
[652,652,"James, Bradie HOU LB",105.15,7.01,4.5,0.75,4,8.25,10.9,6.75,3,"B",7,10,12.75,7.5,null,5.25,3.75,11,9.75,"Free Agent",8,null,null,"James, Bradie HOU LB"]
[653,653,"James, LaMichael SFO RB",34.08,8.52,null,null,null,null,null,null,null,null,"B",null,null,null,null,8.66,8.42,11.78,5.22,"Polk High",9,null,null,"James, LaMichael SFO RB"]
[654,654,"Jamison, Tim HOU DE",15.95,2.6579999999999999,12.2,0,2.5,1.25,0,0,null,"B",null,null,null,null,null,null,null,null,null,"Free Agent",8,null,null,"Jamison, Tim HOU DE"]
[655,655,"Jammer, Quentin SDC CB",160.15,10.009,15.25,4.5,3,15,18.399999999999999,23.75,"B",3,8.75,7,4.5,12.25,14.25,13,6.25,2.25,9,"Free Agent",7,null,null,"Jammer, Quentin SDC CB"]
[656,656,"Janikowski, Sebastian OAK PK",129.5,8.0939999999999994,7.5,7,10.5,6,"B",9.5,14.5,14,6,8.5,5.5,5.5,6.5,1,18.5,6,3,"Free Agent",5,null,null,"Janikowski, Sebastian OAK PK"]
[657,657,"Jarrett, Jaiquawn NYJ S",0,0,0,null,null,null,null,null,null,null,"B",null,null,null,null,null,null,null,null,"Free Agent",9,null,null,"Jarrett, Jaiquawn NYJ S"]
[658,658,"Jean, Lestar HOU WR",30.6,2.1859999999999999,2.15,0,6.85,null,null,0,0,"B",0,0,2.35,0,13.65,5.6,0,0,0,"Free Agent",8,null,null,"Jean, Lestar HOU WR"]
[659,659,"Jean-Francois, Ricky SFO DT",58.1,3.6309999999999998,0,0,6,0,2.5,2.5,0,0,"B",0,6,3.75,0,0,11.7,7.5,18.149999999999999,"Free Agent",9,null,null,"Jean-Francois, Ricky SFO DT"]
[660,660,"Jefferson, A.J. MIN CB",67.55,4.8250000000000002,null,null,0,0,1.5,0,2.5,4,3.75,5.25,"B",3,11.5,8.5500000000000007,7.5,12.5,7.5,"Free Agent",11,null,null,"Jefferson, A.J. MIN CB"]
[661,661,"Jeffery, Alshon CHI WR",86.7,8.67,18.75,1.95,10.75,6.95,10.5,"B",null,null,null,null,4,null,null,15.45,0,4.75,13.6,"Rancho Cucamonga Ghosts (P)",6,null,null,"Jeffery, Alshon CHI WR"]
[662,662,"Jenkins, A.J. SFO WR",0,0,null,null,null,null,null,null,null,null,"B",null,null,null,null,0,0,null,0,"Free Agent",9,null,null,"Jenkins, A.J. SFO WR"]
[663,663,"Jenkins, Cullen PHI DT",101.9,6.3689999999999998,9.5,4.5,0,9.75,2.5,5,"B",15.6,3.75,8.9,3.75,0,6,8.8000000000000007,14.6,2.5,6.75,"Free Agent",7,null,null,"Jenkins, Cullen PHI DT"]
[664,664,"Jenkins, Janoris STL CB",207.32,13.821,18.399999999999999,11,10.75,7.25,14.22,7.4,11.25,12.5,"B",null,9.75,37.5,15.25,10.75,13.2,26.6,1.5,"The Black Champion",9,null,null,"Jenkins, Janoris STL CB"]
[665,665,"Jenkins, Jarvis WAS DE",44.5,2.7810000000000001,0,2.5,1.25,2.5,6.25,1.25,5,0,0,"B",0,0,5,11,1.25,3.5,5,"Free Agent (S)",10,null,null,"Jenkins, Jarvis WAS DE"]
[666,666,"Jenkins, Malcolm NOS S",159.75,12.288,6,13.5,14.75,16,6.25,"B",12.25,12.75,15,18.75,27.25,12.75,4.5,0,null,null,null,"Free Agent (P)",6,null,null,"Jenkins, Malcolm NOS S"]
[667,667,"Jenkins, Michael MIN WR",106.9,6.681,8.25,10.55,2.0499999999999998,1.65,7.25,20.2,1.95,12.8,3.3,3.7,"B",4.2,0,8.6,2.35,6.6,13.45,"Free Agent",11,null,null,"Jenkins, Michael MIN WR"]
[668,668,"Jenkins, Mike DAL CB",25.5,1.962,null,0,4,1.5,"B",2.5,0,1.5,2.5,null,null,1.5,1.5,1.5,5.25,3,0.75,"Free Agent",5,null,null,"Jenkins, Mike DAL CB"]
[669,669,"Jennings, Brian SFO TE",0,0,null,null,null,null,null,null,null,0,"B",null,0,0,0,0,0,0,0,"Free Agent",9,null,null,"Jennings, Brian SFO TE"]
[670,670,"Jennings, Greg GBP WR",106.6,13.324999999999999,9.65,null,11,8.15,null,null,null,null,null,"B",null,null,9.6,3.95,10,19.25,35,"Roddy White Man Can't Jump",10,null,null,"Jennings, Greg GBP WR"]
[671,671,"Jennings, M.D. GBP S",80.95,5.0590000000000002,0,0,0,3,0,9.75,3.75,6.75,5.5,"B",22.95,6.75,6,5.25,2.25,3,6,"Free Agent",10,null,null,"Jennings, M.D. GBP S"]
[672,672,"Jennings, Rashad JAC RB",77.94,7.7939999999999996,5,null,null,3.08,2.9,"B",23.2,14.5,9.1999999999999993,2.7,5.86,11.5,0,null,null,null,null,"Free Agent",6,null,null,"Jennings, Rashad JAC RB"]
[673,673,"Jennings, Tim CHI CB",200.25,14.304,27.3,18.75,14.4,7.5,11.5,"B",12,38.200000000000003,9.5,20,7.5,7.5,4,null,null,6,16.100000000000001,"Rancho Cucamonga Ghosts",6,null,null,"Jennings, Tim CHI CB"]
[674,674,"Jernigan, Jerrel NYG WR",5.95,0.66100000000000003,null,null,0,null,1.85,null,null,null,0,null,"B",0,2.15,-0.6,0,1.95,0.6,"Free Agent",11,null,null,"Jernigan, Jerrel NYG WR"]
[675,675,"Jerry, Peria ATL DT",34.25,2.4460000000000002,0,3.5,1.25,2.5,2.5,3.75,"B",0,0,0,5,null,null,1.25,2.5,7,5,"Free Agent",7,null,null,"Jerry, Peria ATL DT"]
[676,676,"Johnson, Andre HOU WR",343.77,21.486000000000001,27.9,5.85,16.7,9.35,2.75,17.5,19.850000000000001,"B",21.8,8.5,60.99,34.81,11.85,19.5,38.869999999999997,18.45,29.1,"BELAC",8,null,null,"Johnson, Andre HOU WR"]
[677,677,"Johnson, Antonio IND DT",56.75,4.0540000000000003,0,0,3.75,"B",0,12.5,3.75,1.25,5,5,5.5,1.25,13.75,0,5,null,null,"Free Agent",4,null,null,"Johnson, Antonio IND DT"]
[678,678,"Johnson, Brandon PIT LB",0.75,5.3999999999999999E-2,0,0.75,0,"B",null,0,0,null,0,0,0,0,0,0,0,0,0,"Free Agent",4,null,null,"Johnson, Brandon PIT LB"]
[679,679,"Johnson, Calvin DET WR",394.56,24.66,19.600000000000001,19.399999999999999,38.18,11.65,"B",21,7.15,8.35,21.65,45.91,24.55,30,43.77,24.3,24.6,41,13.45,"Roddy White Man Can't Jump (P)",5,null,null,"Johnson, Calvin DET WR"]
[680,680,"Johnson, Cam SFO LB",0,0,null,null,null,null,null,null,null,null,"B",null,null,null,null,null,null,0,0,"Free Agent",9,null,null,"Johnson, Cam SFO LB"]
[681,681,"Johnson, Charles CAR DE",210.15,13.134,7.5,9.25,5,44.5,3.75,"B",3.75,30.1,22.05,25.1,2.5,9,2.5,1.25,22.6,2.5,18.8,"Roddy White Man Can't Jump",6,null,null,"Johnson, Charles CAR DE"]
[682,682,"Johnson, Chris TEN RB",219.04,13.69,11.1,4.8,3.9,20.52,0.9,15.4,37.700000000000003,13.7,22.92,20.399999999999999,"B",11.9,8.1,8.9,19.2,6.1,13.5,"Polk High",11,null,null,"Johnson, Chris TEN RB"]
[683,683,"Johnson, Damaris PHI WR",69.959999999999994,4.9969999999999999,2.65,3.82,12.72,3.05,0.87,null,"B",null,1.33,4.72,5.22,5.93,15.48,3.83,0.4,6.92,3.02,"Free Agent",7,null,null,"Johnson, Damaris PHI WR"]
[684,684,"Johnson, Derrick KCC LB",217.75,13.609,11.25,12,18,10,9,17,"B",20.5,6.75,23.75,19,6,7.5,14,14,16.5,12.5,"Derek's Daycare ",7,null,null,"Johnson, Derrick KCC LB"]
[685,685,"Johnson, James-Michael CLE LB",38.75,3.875,null,null,null,null,0,2.25,0.75,10.75,7.5,"B",5.25,6.25,0,1.5,4.5,null,null,"Free Agent",10,null,null,"Johnson, James-Michael CLE LB"]
[686,686,"Johnson, Jarret SDC LB",65.75,4.383,6.75,1.5,3,0,5.5,6,"B",3,12.5,6,2.5,5,null,1.5,5.75,5.25,1.5,"Free Agent",7,null,null,"Johnson, Jarret SDC LB"]
[687,687,"Johnson, Jeron SEA S",20.55,1.284,0,0,1.5,0,0,0,0,0,7.6,0,"B",0,0,10.7,0.75,0,0,"Free Agent",11,null,null,"Johnson, Jeron SEA S"]
[688,688,"Johnson, Josh CLE QB",-4,-4,null,null,null,null,null,null,null,null,null,"B",null,null,null,null,null,null,-4,"Free Agent",10,null,null,"Johnson, Josh CLE QB"]
[689,689,"Johnson, Leonard TBB CB",111.35,7.423,null,0,0,0,"B",2.5,0,15.5,18.55,28.55,3,9,3,5.5,3,16.5,6.25,"Free Agent",5,null,null,"Johnson, Leonard TBB CB"]
[690,690,"Johnson, Michael CIN DE",202.15,12.634,5,13.5,35.950000000000003,0,15.55,13.8,22.35,"B",0,3.75,17,14.6,10,8.6999999999999993,2.5,21.05,18.399999999999999,"Polk High",8,null,null,"Johnson, Michael CIN DE"]
[691,691,"Johnson, Quinn TEN RB",9.5,0.59399999999999997,0,0,1.5,2.7,2.5,0,0,1.1000000000000001,0,0.3,"B",0,0,0,1.4,0,0,"Free Agent",11,null,null,"Johnson, Quinn TEN RB"]
[692,692,"Johnson, Rashad ARI S",50.2,3.347,0,0,6.75,0,0,1.5,0,0,0,"B",14.9,0,0,2.25,23.3,null,1.5,"Free Agent (Q)",10,null,null,"Johnson, Rashad ARI S"]
[693,693,"Johnson, Robert TEN S",25.45,2.121,6,6.5,0.75,1.5,7.7,0,0,0,0.75,0,"B",1.5,0.75,null,null,null,null,"Free Agent",11,null,null,"Johnson, Robert TEN S"]
[694,694,"Johnson, Spencer BUF DT",58.05,3.87,5,2.5,5,0,null,0,4.25,"B",2.5,3.75,1.25,1.75,0,5,9.9499999999999993,0,17.100000000000001,"Free Agent",8,null,null,"Johnson, Spencer BUF DT"]
[695,695,"Johnson, Steven DEN LB",3,0.27300000000000002,null,0,null,0,null,null,"B",null,0,0,0,0,0,0,3,0,0,"Free Agent",7,null,null,"Johnson, Steven DEN LB"]
[696,696,"Johnson, Stevie BUF WR",238.35,14.897,16.5,15.1,20.85,4.8,11.4,15.7,19.350000000000001,"B",6.65,16.100000000000001,15.4,19.100000000000001,10.3,14.6,27.5,6.4,18.600000000000001,"Derek's Daycare (P)",8,null,null,"Johnson, Stevie BUF WR"]
[697,697,"Johnson, Tom NOS DT",75.5,5.0330000000000004,1.25,0,5.25,2.5,3.75,"B",5,7.5,7.5,6.25,12.2,3.75,null,1.25,3.75,11.8,3.75,"Free Agent",6,null,null,"Johnson, Tom NOS DT"]
[698,698,"Johnson, Trumaine STL CB",75.900000000000006,4.7439999999999998,0,0,0,7.9,6,1.5,2.5,2.5,"B",6,3,4.5,1.5,5.5,4,19,12,"Free Agent",9,null,null,"Johnson, Trumaine STL CB"]
[699,699,"Johnson, Tyrell DET S",4.25,1.0620000000000001,null,null,null,null,"B",null,null,null,null,null,null,null,null,0,0,2,2.25,"Free Agent",5,null,null,"Johnson, Tyrell DET S"]
[700,700,"Johnson, Will PIT RB",36.72,2.2949999999999999,2.2000000000000002,3.6,1.4,"B",0,0,1.7,9.1199999999999992,1.7,1.7,0,3.3,2.9,0,5.4,0,3.7,"Free Agent",4,null,null,"Johnson, Will PIT RB"]
[701,701,"Jones, Adam CIN CB",113.37,7.0860000000000003,0,13.24,8.25,5.5,5.67,3,5.58,"B",-7.0000000000000007E-2,22.38,16.329999999999998,7.65,2.6,9.5500000000000007,5.67,5.37,2.65,"Free Agent",8,null,null,"Jones, Adam CIN CB"]
[702,702,"Jones, Art BAL DE",126.9,7.931,10,0,0,2.5,9.25,2.5,8.75,"B",6.25,3.75,6.25,25.75,15.05,18.100000000000001,7.5,2.5,8.75,"Free Agent",8,null,null,"Jones, Art BAL DE"]
[703,703,"Jones, Brad GBP LB",129.65,8.1029999999999998,0,0,0,0,0,4,3,22.55,11.75,"B",6.25,11.5,12.25,15,15.5,21.85,6,"Invictus",10,null,null,"Jones, Brad GBP LB"]
[704,704,"Jones, Chandler NEP DE",145.55000000000001,10.396000000000001,20.100000000000001,14,2.5,17.5,3.75,32.25,8.75,15.2,"B",1.25,0,null,null,6.25,5,0,19,"The Black Champion",9,null,null,"Jones, Chandler NEP DE"]
[705,705,"Jones, Donald BUF WR",117.55,9.7959999999999994,16.350000000000001,1.1499999999999999,10.45,18.5,3.8,2.15,15.7,"B",14,20.9,0.6,6.9,null,7.05,null,null,null,"Free Agent",8,null,null,{"$f":"IF(ISBLANK(C715),\"\",C715)","v":"Jones, Donald BUF WR"}]
[706,706,"Jones, Felix DAL RB",124.84,7.8019999999999996,2.44,9.4600000000000009,5.42,3.22,"B",17.5,12.4,4.9000000000000004,15.9,18.3,13.5,15.1,2.6,0.7,1,0,2.4,"Free Agent (Q)",5,null,null,"Jones, Felix DAL RB"]
[707,707,"Jones, Greg JAC RB",18.2,1.5169999999999999,1.9,1.4,3.3,6.5,0,"B",0,0,null,null,null,null,0,3.2,0.3,1.6,0,"Free Agent",6,null,null,"Jones, Greg JAC RB"]
[708,708,"Jones, Greg JAC LB",0,0,null,null,null,null,null,"B",null,null,null,null,0,0,0,0,0,0,null,"Free Agent",6,null,null,"Jones, Greg JAC LB"]
[709,709,"Jones, Jacoby BAL WR",171.13,10.696,8.9499999999999993,11.62,12.62,4.2,0.67,16.36,12.04,"B",3.67,22.1,15.32,17.16,4.71,7.47,13.13,7.72,13.39,"Free Agent",8,null,null,"Jones, Jacoby BAL WR"]
[710,710,"Jones, James GBP WR",243.4,15.212,20.100000000000001,2.4,11.75,23.85,21.6,19.05,12.8,16.55,17.100000000000001,"B",5.8,0,12.5,5.2,30.25,24.75,19.7,"I like my Women like I like my coffee, _______.",10,null,null,"Jones, James GBP WR"]
[711,711,"Jones, Jason SEA DT",52.75,4.3959999999999999,6.25,4.45,0,9.3000000000000007,0,0,8.6999999999999993,null,null,2,"B",2.5,5,5,9.5500000000000007,null,null,"Free Agent",11,null,null,"Jones, Jason SEA DT"]
[712,712,"Jones, Julio ATL WR",286.55,17.908999999999999,30.3,6.5,18.95,4.25,28,11.3,"B",26.45,20.95,13.5,7.05,29.2,11.05,18.850000000000001,29.7,21.15,9.35,"Angry Neighbors (P)",7,null,null,"Jones, Julio ATL WR"]
[713,713,"Jones, Marvin CIN WR",53.3,4.8449999999999998,0,0,null,1.75,null,4.5999999999999996,0,"B",null,null,null,0,4.5,11.95,1,12.75,16.75,"Free Agent",8,null,null,"Jones, Marvin CIN WR"]
[714,714,"Jones, Reshad MIA S",194.55,12.159000000000001,10,13.8,10,5.25,16.2,9,"B",9.25,12.5,3,24.75,6,30.5,12,6.25,16.3,9.75,"Invictus",7,null,null,"Jones, Reshad MIA S"]
[715,715,"Jones, Taiwan OAK RB",6.88,0.49099999999999999,1.04,0,0,0,"B",0,null,null,1.6,2.2999999999999998,1.94,0,0,0,0,0,0,"Free Agent",5,null,null,"Jones, Taiwan OAK RB"]
[716,716,"Jones-Drew, Maurice JAC RB",79.81,13.302,11.77,15.7,31.84,13,6.9,"B",0.6,null,null,null,null,null,null,null,null,null,null,"Invictus (P)",6,null,null,"Jones-Drew, Maurice JAC RB"]
[717,717,"Jordan, Akeem PHI LB",52.04,3.7170000000000001,1.5,3.04,0,null,null,6,"B",3,6,5.25,6.75,4,6.25,0.75,0,0,9.5,"Free Agent",7,null,null,"Jordan, Akeem PHI LB"]
[718,718,"Jordan, Cameron NOS DE",210.9,13.180999999999999,20,15.65,12.25,5,12.95,"B",14.4,6.25,34.35,6,6.25,11.75,17.850000000000001,11.75,17.95,8.5,10,"Invictus",6,null,null,"Jordan, Cameron NOS DE"]
[719,719,"Joseph, Johnathan HOU CB",136.55000000000001,9.7539999999999996,18.350000000000001,4.5,15,5.75,7.5,9.75,25.45,"B",8.5,10,5.5,null,null,8.25,3,10,5,"Free Agent",8,null,null,"Joseph, Johnathan HOU CB"]
[720,720,"Joseph, Linval NYG DT",149.69999999999999,9.3559999999999999,11.9,9,5,1.25,6.25,15.95,10,18.350000000000001,15,3.75,"B",7.5,11.25,8.25,6.25,12.5,7.5,"Polk High",11,null,null,"Joseph, Linval NYG DT"]
[721,721,"Kaddu, Josh MIA LB",0,0,null,null,null,null,null,0,"B",null,null,0,null,null,null,null,0,0,null,"Free Agent",7,null,null,"Kaddu, Josh MIA LB"]
[722,722,"Kaeding, Nate MIA PK",34,6.8,17,8,3.5,null,null,null,"B",null,null,null,null,null,null,null,null,6.5,-1,"Free Agent",7,null,null,"Kaeding, Nate MIA PK"]
[723,723,"Kaepernick, Colin SFO QB",161.66,12.435,1.7,null,null,11,7.18,1.88,-0.1,null,"B",12.28,20.72,21.94,10.220000000000001,14.7,24.74,13.86,21.54,"Klingon Warriors",9,null,null,"Kaepernick, Colin SFO QB"]
[724,724,"Karim, Deji IND RB",19.12,6.3730000000000002,null,null,null,"B",null,null,null,null,null,null,null,null,null,null,4.4400000000000004,2.3199999999999998,12.36,"Free Agent",4,null,null,"Karim, Deji IND RB"]
[725,725,"Kearse, Frank CAR DT",33.049999999999997,4.1310000000000002,3.75,null,0,null,5,"B",null,null,null,null,null,null,5,10.55,5,0,3.75,"Free Agent",6,null,null,"Kearse, Frank CAR DT"]
[726,726,"Kearse, Jermaine SEA WR",6.85,0.97899999999999998,null,null,null,null,null,null,null,null,1.85,0,"B",2.0499999999999998,null,0,0,2.95,0,"Free Agent",11,null,null,"Kearse, Jermaine SEA WR"]
[727,727,"Kehl, Bryan WAS LB",0,0,null,null,null,null,0,null,null,null,null,"B",0,0,0,0,0,0,0,"Free Agent",10,null,null,"Kehl, Bryan WAS LB"]
[728,728,"Keisel, Brett PIT DE",124.9,7.806,2.5,7.5,0,"B",3,6.25,1.25,5.5,7.5,30.1,11.25,16.149999999999999,7.5,3.75,2,18.149999999999999,2.5,"Free Agent",4,null,null,"Keisel, Brett PIT DE"]
[729,729,"Keiser, Thomas CAR DE",10.6,2.65,null,9.35,1.25,0,null,"B",0,null,null,null,null,null,null,null,null,null,null,"Free Agent",6,null,null,"Keiser, Thomas CAR DE"]
[730,730,"Keller, Dustin NYJ TE",85.7,10.712999999999999,2.2000000000000002,null,null,null,null,2.1,25.8,17.2,"B",9.1999999999999993,4.5999999999999996,19.899999999999999,4.7,null,null,null,null,"Aaron Hernandez's Pistol Offense",9,null,null,"Keller, Dustin NYJ TE"]
[731,731,"Kelly, Tommy OAK DT",109.95,6.8719999999999999,8,11,1.25,4.25,"B",0,8.75,2,3.75,2.5,1.25,5,10,11,16.8,14.4,10,"Free Agent",5,null,null,"Kelly, Tommy OAK DT"]
[732,732,"Kelsay, Chris BUF DE",50,5.556,6,0,0,0,2.5,26.35,11.4,"B",3.75,null,null,0,null,null,null,null,null,"Free Agent",8,null,null,"Kelsay, Chris BUF DE"]
[733,733,"Kemoeatu, Ma'ake BAL DT",71.099999999999994,4.74,2.5,6.25,1.25,0,5,10,null,"B",0,1.25,2.5,8.75,1.25,10.25,6.25,0,15.85,"Free Agent",8,null,null,"Kemoeatu, Ma'ake BAL DT"]
[734,734,"Kendricks, Lance STL TE",140.9,8.8059999999999992,4.5999999999999996,5.5,6.3,5.2,8.1999999999999993,10,3.5,9.1999999999999993,"B",9.3000000000000007,2.4,11.2,9.6999999999999993,8.1,14,25.9,7.8,"Free Agent (Q)",9,null,null,"Kendricks, Lance STL TE"]
[735,735,"Kendricks, Mychal PHI LB",132.75,8.85,6.75,12.5,7.25,2.25,8.5,6,"B",5.5,7.25,17,9.25,6.25,9,17.5,8.75,9,null,"Invictus",7,null,null,"Kendricks, Mychal PHI LB"]
[736,736,"Keo, Shiloh HOU S",12.85,0.80300000000000005,0,0,0,0,0,2.25,0,"B",0,0,0,0,0,7.6,1.5,1.5,0,"Free Agent",8,null,null,"Keo, Shiloh HOU S"]
[737,737,"Kerley, Jeremy NYJ WR",181.47,11.342000000000001,26.03,7.6,19.8,3.7,16.75,6.15,22.42,10.55,"B",10.85,7.95,14.35,8.58,5.9,2.82,3.47,14.55,"The Black Champion (P)",9,null,null,"Kerley, Jeremy NYJ WR"]
[738,738,"Kerrigan, Ryan WAS LB",172.4,10.775,9.6,11.2,12.05,13.6,22.3,2.25,1.5,15.2,0.75,"B",17.5,15.6,4.5,6,9.5,24.1,6.75,"Free Agent",10,null,null,"Kerrigan, Ryan WAS LB"]
[739,739,"Kindle, Sergio FA LB",2.5,2.5,null,2.5,null,null,null,null,null,null,null,null,null,null,null,null,null,null,null,"Free Agent","-",null,null,"Kindle, Sergio FA LB"]
[740,740,"King, Jeff ARI TE",38.4,2.4,3.8,0,3,5.2,1.9,4,0,8.8000000000000007,0,"B",0,2.4,0,0,2.2000000000000002,1.6,5.5,"Free Agent (P)",10,null,null,"King, Jeff ARI TE"]
[741,741,"King, Justin PIT CB",8,2.6669999999999998,7.25,0,0.75,"B",null,null,null,null,null,null,null,null,null,null,null,null,null,"Free Agent (I)",4,null,null,"King, Justin PIT CB"]
[742,742,"Kirkpatrick, Dre CIN CB",3,0.6,null,null,null,null,null,null,null,"B",0,0,3,0,0,null,null,null,null,"Free Agent (P)",8,null,null,"Kirkpatrick, Dre CIN CB"]
[743,743,"Kitchen, Ishmaa'ily CLE DT",28.75,1.917,2.5,2.5,0,0,5,3.75,3.75,3.75,3.75,"B",0,0,0,2.5,1.25,null,0,"Free Agent",10,null,null,"Kitchen, Ishmaa'ily CLE DT"]
[744,744,"Kiwanuka, Mathias NYG LB",88.45,5.5279999999999996,2.5,5.5,2.5,6.25,2.5,9.9,5,0,2.5,6.25,"B",27.05,1.25,0,6.25,8.5,2.5,"Free Agent",11,null,null,"Kiwanuka, Mathias NYG LB"]
[745,745,"Klug, Karl TEN DT",39.25,2.4529999999999998,0,1.25,0,0,0,0,0,0,0,1.25,"B",8.6999999999999993,0,21.1,0,0,6.95,"Free Agent",11,null,null,"Klug, Karl TEN DT"]
[746,746,"Knighton, Terrance JAC DT",91.2,5.7,17.899999999999999,1.25,0,3.75,9.75,"B",18.55,5,2.5,0,3.75,3.5,8.5,6.25,0,2.5,8,"Free Agent",6,null,null,"Knighton, Terrance JAC DT"]
[747,747,"Kolb, Kevin ARI QB",66.3,11.05,7.54,14.6,17.48,18.2,-0.24,8.7200000000000006,null,null,null,"B",null,null,null,null,null,null,null,"Free Agent (P)",10,null,null,"Kolb, Kevin ARI QB"]
[748,748,"Kruger, Paul BAL DE",137.65,9.1769999999999996,0.75,null,4.5,14.6,10.5,2.25,5.5,"B",3,28.85,15.2,12.5,7.8,19.95,2.25,0,10,"Free Agent",8,null,null,"Kruger, Paul BAL DE"]
[749,749,"Kuechly, Luke CAR LB",254.1,15.881,4.5,4.5,18,8.5,21.7,"B",19.75,15.25,18,14.5,13,12.25,21.9,20.25,9.75,30,22.25,"Roddy White Man Can't Jump",6,null,null,"Kuechly, Luke CAR LB"]
[750,750,"Kuhn, John GBP RB",42.1,3.0070000000000001,0,5.4,5.7,0.5,8.5,0.6,4.2,null,null,"B",-0.1,9.6,5.8,-0.5,0.5,1.9,0,"Free Agent",10,null,null,"Kuhn, John GBP RB"]
[751,751,"Kuhn, Markus NYG DT",25.5,2.5499999999999998,1.25,1.75,1.25,0,8.75,0,7.5,2.5,0,2.5,"B",null,null,null,null,null,null,"Free Agent (Q)",11,null,null,"Kuhn, Markus NYG DT"]
[752,752,"LaFell, Brandon CAR WR",149.19999999999999,10.657,16.25,19,3.95,0,8.15,"B",16.3,13.55,null,7.9,21.55,18.75,0.9,null,0,10.050000000000001,12.85,"BELAC",6,null,null,"LaFell, Brandon CAR WR"]
[753,753,"Lacey, Jacob DET CB",64,5.8179999999999996,3,3.75,3.75,1.5,"B",4.5,null,null,4.5,9.75,16.5,null,9.25,4.5,3,null,null,"Free Agent (O)",5,null,null,"Lacey, Jacob DET CB"]
[754,754,"Lamur, Emmanuel CIN LB",17,1.889,null,null,null,null,null,null,null,"B",4.75,3.75,0,0.75,0,1.5,4,0,2.25,"Free Agent",8,null,null,"Lamur, Emmanuel CIN LB"]
[755,755,"Landri, Derek PHI DT",51.25,3.2029999999999998,0,2.5,6,6.25,7.5,3.5,"B",3.5,0,7.5,2.5,3.5,4.75,2.5,0,0,1.25,"Free Agent",7,null,null,"Landri, Derek PHI DT"]
[756,756,"Landry, Dawan JAC S",150.69999999999999,9.4190000000000005,10.5,10.5,7.4,6,9.75,"B",7.5,8.25,7.5,21.6,12.2,12,12.25,9,7.5,4.5,4.25,"Free Agent",6,null,null,"Landry, Dawan JAC S"]
[757,757,"Landry, LaRon NYJ S",186.45,11.653,12.75,6.75,18.3,12.25,9.75,11.5,18,7.5,"B",5.25,18,17.25,13.65,15.25,9.5,3,7.75,"Polk High (P)",9,null,null,"Landry, LaRon NYJ S"]
[758,758,"Lane, Austen JAC DE",84,7.6360000000000001,null,null,null,2.5,15.25,"B",11.25,10,6.25,11.5,1.25,3.75,null,8.75,7.5,null,6,"Free Agent",6,null,null,"Lane, Austen JAC DE"]
[759,759,"Lane, Jeremy SEA CB",12.75,0.98099999999999998,0,null,0,1.5,null,null,0,0,0,0,"B",0,0,0.75,3.75,4.5,2.25,"Free Agent",11,null,null,"Lane, Jeremy SEA CB"]
[760,760,"Lane, Jorvorskie MIA RB",37.880000000000003,2.367,4.12,1.2,7.5,7.2,0.5,3.2,"B",0,0,0,0,0,1.2,0.96,8.6,0,3.4,"Free Agent",7,null,null,"Lane, Jorvorskie MIA RB"]
[761,761,"Langford, Kendall STL DT",78.45,4.9029999999999996,2.5,0,0,5,3.5,8.5,3.5,2.5,"B",9.75,2.5,7.5,5,11.2,5,9,3,"Free Agent",9,null,null,"Langford, Kendall STL DT"]
[762,762,"Lattimore, Jamari GBP LB",0,0,null,0,null,0,0,0,0,0,0,"B",0,0,0,0,0,0,0,"Free Agent",10,null,null,"Lattimore, Jamari GBP LB"]
[763,763,"Laurinaitis, James STL LB",225.35,14.084,10.5,14.5,17.5,12.75,15.3,9,20.25,7.5,"B",9.75,16.75,25.55,15,9.5,9,27.25,5.25,"Aaron Hernandez's Pistol Offense",9,null,null,"Laurinaitis, James STL LB"]
[764,764,"Lawson, Manny CIN LB",70.849999999999994,4.4279999999999999,9,3.75,2.25,13.2,6,1.5,2.25,"B",0,1.5,1.5,11.65,3,5.25,3,4,3,"Free Agent",8,null,null,"Lawson, Manny CIN LB"]
[765,765,"Leach, Vonta BAL RB",44.5,2.7810000000000001,4.8,8.1,2.7,4.5,3.2,1.7,0.6,"B",0.8,1.3,0,1.1000000000000001,8,3.4,3.1,0,1.2,"Free Agent",8,null,null,"Leach, Vonta BAL RB"]
[766,766,"Lee, Pat DET CB",61.65,4.1100000000000003,2.25,5.5,8.25,10,"B",3,5.75,16.399999999999999,6,null,0,0,0,1.5,0,0,3,"Free Agent",5,null,null,"Lee, Pat DET CB"]
[767,767,"Lee, Sean DAL LB",86.25,14.375,19.5,14,15.75,18.5,"B",8.5,10,null,null,null,null,null,null,null,null,null,null,"Derek's Daycare ",5,null,null,"Lee, Sean DAL LB"]
[768,768,"Lefeged, Joe IND S",31.47,1.9670000000000001,1.5,0,0,"B",0,0,1.5,0,0,0,0,2.72,3.75,5.25,4.5,10.75,1.5,"Free Agent (Q)",4,null,null,"Lefeged, Joe IND S"]
[769,769,"Leftwich, Byron PIT QB",13.98,6.99,null,null,null,"B",null,null,null,null,null,2.92,11.06,null,null,null,null,null,null,"Free Agent",4,null,null,{"$f":"IF(ISBLANK(C779),\"\",C779)","v":"Leftwich, Byron PIT QB"}]
[770,770,"Leinart, Matt OAK QB",0.6,0.3,null,null,null,null,"B",null,null,null,null,0,null,null,null,null,null,0.6,null,"Free Agent",5,null,null,"Leinart, Matt OAK QB"]
[771,771,"Lemon, Orie DAL LB",5.5,1.1000000000000001,null,null,2.5,0,"B",null,0,3,0,null,null,null,null,null,null,null,null,"Free Agent",5,null,null,"Lemon, Orie DAL LB"]
[772,772,"Lenon, Paris ARI LB",164.8,10.3,28.55,11.25,4.5,10.5,6,6,10.5,13.5,12.25,"B",9.25,7.5,6.75,18,7.5,6.75,6,"Free Agent",10,null,null,"Lenon, Paris ARI LB"]
[773,773,"Leonard, Brian CIN RB",28.3,1.887,0.5,0,1.8,2.6,3.9,1.3,null,"B",5.8,0.4,2.1,0,0.1,2,2.2999999999999998,0,5.5,"Free Agent",8,null,null,"Leonard, Brian CIN RB"]
[774,774,"Leonhard, Jim DEN S",45.91,2.8690000000000002,2.97,1.63,1.79,2.8,0,12,"B",3,3,0.75,7.5,1.5,6.25,0,0.75,1.5,0.47,"Free Agent",7,null,null,"Leonhard, Jim DEN S"]
[775,775,"Leshoure, Mikel DET RB",180.2,12.871,null,null,23.4,7.3,"B",12.4,11.3,8.5,25,5.8,15.2,13.9,15.3,4.9000000000000004,13.9,12.6,10.7,"Polk High (P)",5,null,null,"Leshoure, Mikel DET RB"]
[776,776,"Levy, DeAndre DET LB",123.65,8.8320000000000007,6.75,15.5,10.25,13.25,"B",4,10,null,null,8.5,11.5,2.75,3.75,5.25,11.9,9.5,10.75,"Free Agent",5,null,null,"Levy, DeAndre DET LB"]
[777,777,"Lewis, Dion PHI RB",18.62,2.069,null,null,null,null,0,null,"B",null,null,0,0,2.4,1.4,4.72,0.9,7.7,1.5,"Free Agent (O)",7,null,null,"Lewis, Dion PHI RB"]
[778,778,"Lewis, Keenan PIT CB",152.75,9.5470000000000006,13.5,4.5,3.75,"B",16,15,9.5,9,9.75,9.25,18.5,7.5,8.5,5.5,7,12.5,3,"Free Agent",4,null,null,"Lewis, Keenan PIT CB"]
[779,779,"Lewis, Kendrick KCC S",42.5,4.7220000000000004,null,null,null,null,null,4.5,"B",6.75,1.5,3,3,7.5,null,null,2.5,7,6.75,"Free Agent",7,null,null,"Lewis, Kendrick KCC S"]
[780,780,"Lewis, Marcedes JAC TE",157,9.8119999999999994,18.7,0,2.2999999999999998,13.7,9.9,"B",6.5,5.0999999999999996,10.1,8.1,20.5,11.6,13.8,1.9,5.3,8.6999999999999993,20.8,"Klingon Warriors",6,null,null,"Lewis, Marcedes JAC TE"]
[781,781,"Lewis, Myron TBB CB",4.5,0.5,null,0,0,null,"B",0,null,null,1.5,3,0,0,0,0,null,null,null,"Free Agent",5,null,null,"Lewis, Myron TBB CB"]
[782,782,"Lewis, Ray BAL LB",90.75,15.125,27.75,12.5,12.75,5.25,16,16.5,null,"B",null,null,null,null,null,null,null,null,null,"Free Agent",8,null,null,"Lewis, Ray BAL LB"]
[783,783,"Lewis, Ronnell DET DE",0,0,0,0,0,0,"B",0,null,0,0,0,null,null,null,null,null,null,null,"Free Agent",5,null,null,"Lewis, Ronnell DET DE"]
[784,784,"Lewis, Thaddeus CLE QB",7.46,7.46,null,null,null,null,null,null,null,null,null,"B",null,null,null,null,null,null,7.46,"Free Agent",10,null,null,"Lewis, Thaddeus CLE QB"]
[785,785,"Lewis, Travis DET LB",4.5,0.34599999999999997,0,null,null,null,"B",0,0,1.5,0,0,3,0,0,0,0,0,0,"Free Agent",5,null,null,"Lewis, Travis DET LB"]
[786,786,"Lindell, Rian BUF PK",105.5,6.5940000000000003,4,5,6,4,3,5,10.5,"B",8,7.5,13.5,7,11.5,6.5,5.5,4.5,4,"Free Agent",8,null,null,"Lindell, Rian BUF PK"]
[787,787,"Lindley, Ryan ARI QB",-6.1,-0.871,null,null,null,null,null,0,null,null,null,"B",-3.44,1.7,-2.12,-2.84,-0.04,0.64,null,"Free Agent",10,null,null,"Lindley, Ryan ARI QB"]
[788,788,"Lissemore, Sean DAL DE",69.3,6.93,3.75,16.25,6.25,8.75,"B",2.5,null,null,null,null,null,null,7.5,1.25,11.8,5,6.25,"Free Agent (P)",5,null,null,"Lissemore, Sean DAL DE"]
[789,789,"Little, Greg CLE WR",157.44999999999999,9.8409999999999993,0,17.95,4.2,13.5,0,5.55,18.7,5.3,11.45,"B",9.0500000000000007,1.85,9.8000000000000007,13.6,13.65,19.3,13.55,"I like my Women like I like my coffee, _______. (P)",10,null,null,"Little, Greg CLE WR"]
[790,790,"Liuget, Corey SDC DE",181.85,11.366,7.5,2.5,0,3.25,16.05,5,"B",20.65,11.25,14.75,2.5,24.15,17.25,14.2,11.75,23.8,7.25,"I like my Women like I like my coffee, _______. (Q)",7,null,null,"Liuget, Corey SDC DE"]
[791,791,"Lloyd, Brandon NEP WR",219.4,13.712999999999999,13.15,16,22.05,14.75,7.15,15.5,1.85,17.3,"B",10.75,9.5,6.35,2.25,30.65,36.299999999999997,13.7,2.15,"Free Agent",9,null,null,"Lloyd, Brandon NEP WR"]
[792,792,"Lloyd, Greg BUF LB",0,0,null,null,null,null,null,null,null,"B",null,null,null,null,null,null,null,0,null,"Free Agent",8,null,null,"Lloyd, Greg BUF LB"]
[793,793,"Locker, Jake TEN QB",115.81,10.528,7.26,12.06,31.2,-1,null,null,null,null,null,17.48,"B",10.54,4.25,15.58,12.26,0.8,5.38,"Free Agent",11,null,null,"Locker, Jake TEN QB"]
[794,794,"Lofton, Curtis NOS LB",195.45,12.215999999999999,9.75,12.25,21.5,15.75,21.45,"B",8.5,18,13.5,7.75,3,10.75,12,12,7.25,13,9,"Aaron Hernandez's Pistol Offense",6,null,null,"Lofton, Curtis NOS LB"]
[795,795,"Logan, Stefan DET RB",47.38,2.9609999999999999,5.25,3.23,2.98,2.33,"B",5.84,-1.77,1.24,0,4.51,1.8,4.97,4.32,4.54,2.76,5.38,0,"Free Agent",5,null,null,"Logan, Stefan DET RB"]
[796,796,"Long, Chris STL DE",152.9,9.5559999999999992,0,6.25,18.2,5,10.65,11.5,1.25,3.5,"B",16.8,20.100000000000001,0,2.5,9.9499999999999993,7,9.1,31.1,"Rancho Cucamonga Ghosts",9,null,null,"Long, Chris STL DE"]
[797,797,"Lorig, Erik TBB RB",26.3,1.6439999999999999,6.1,1.8,0,0,"B",2.6,1.6,7.1,2.1,0,0,0,0,0,0,2.8,2.2000000000000002,"Free Agent",5,null,null,"Lorig, Erik TBB RB"]
[798,798,"Love, Kyle NEP DT",54.9,3.431,3.75,11.25,0,3.75,3.75,3.75,11.4,5,"B",1.25,1.25,0,3.5,0,5,0,1.25,"Free Agent",9,null,null,"Love, Kyle NEP DT"]
[799,799,"Lowery, Dwight JAC S",63.35,7.0389999999999997,7.5,5.25,8,6,5.5,"B",null,null,null,null,null,15.6,3,8.5,4,null,null,"Free Agent",6,null,null,"Lowery, Dwight JAC S"]
[800,800,"Luck, Andrew IND QB",268.91000000000003,16.806999999999999,6.35,20.059999999999999,28.65,"B",28.5,-1.9,14.64,13.68,35.479999999999997,15.18,15.1,9.6,35.85,3.24,14.44,12.3,17.739999999999998,"Angry Neighbors",4,null,null,"Luck, Andrew IND QB"]
[801,801,"Lumpkin, Kregg NYG RB",1.2,0.24,null,null,null,null,null,null,null,null,null,null,"B",null,0,0,1.2,0,0,"Free Agent",11,null,null,"Lumpkin, Kregg NYG RB"]
[802,802,"Lynch, Corey SDC S",91.75,5.734,0,0,1.5,0,4.5,4,"B",0,3.25,0.75,0,14.5,27,7,10.75,10.5,8,"Free Agent",7,null,null,"Lynch, Corey SDC S"]
[803,803,"Lynch, Marshawn SEA RB",266.60000000000002,16.661999999999999,10.7,18.2,10.9,25.5,10.4,6.2,12.6,18.600000000000001,23,19.100000000000001,"B",6.7,13.8,30.8,20.7,27,12.4,"I like my Women like I like my coffee, _______.",11,null,null,"Lynch, Marshawn SEA RB"]
[804,804,"Mack, Elbert NOS CB",47.55,6.7930000000000001,null,null,null,null,null,"B",null,0,null,null,9.75,null,2.25,20.8,10,0,4.75,"Free Agent",6,null,null,"Mack, Elbert NOS CB"]
[805,805,"Maclin, Jeremy PHI WR",214.95,14.33,25.35,9.5500000000000007,null,1.95,10.15,27.5,"B",10.8,5.3,26.3,0,11.75,7.55,27.65,10.3,27.6,13.2,"Polk High (I)",7,null,null,"Maclin, Jeremy PHI WR"]
[806,806,"Maiava, Kaluka CLE LB",84.8,5.3,10.75,0.75,0,2.25,2.25,3,11.75,9,11,"B",6.3,7.5,6.75,5.25,6.75,0,1.5,"Free Agent (Q)",10,null,null,"Maiava, Kaluka CLE LB"]
[807,807,"Mallett, Ryan NEP QB",-3.22,-0.80500000000000005,null,null,null,null,null,null,null,0.38,"B",null,0,-0.3,null,-3.3,null,null,null,"Free Agent",9,null,null,"Mallett, Ryan NEP QB"]
[808,808,"Maneri, Steve KCC TE",13.6,1.046,null,null,2.5,0,0,10.1,"B",null,0,0,0,1,0,0,0,0,0,"Free Agent",7,null,null,"Maneri, Steve KCC TE"]
[809,809,"Manning, Danieal HOU S",163.12,10.195,9.75,4.5,3.75,29,6.25,8.25,4.5,"B",5.25,14.65,19.5,20.75,6.25,8,9.75,6.75,6.22,"Free Agent",8,null,null,"Manning, Danieal HOU S"]
[810,810,"Manning, Eli NYG QB",248.58,15.536,10.52,38.4,16.02,23.45,22.26,12.52,16.25,4.9800000000000004,-1,-4.3,"B",26.16,16.7,24.06,-0.56000000000000005,9.8000000000000007,33.32,"BELAC",11,null,null,"Manning, Eli NYG QB"]
[811,811,"Manning, Peyton DEN QB",350.79,21.923999999999999,21.42,2.54,23.5,32.799999999999997,27.75,28.25,"B",31.65,21.44,17.45,19.8,16.5,22.18,14.2,12.16,28.95,30.2,"Roddy White Man Can't Jump",7,null,null,"Manning, Peyton DEN QB"]
[812,812,"Manning, Terrell GBP LB",0,0,0,null,null,null,null,null,0,0,0,"B",null,null,null,null,null,0,null,"Free Agent",10,null,null,"Manning, Terrell GBP LB"]
[813,813,"Manningham, Mario SFO WR",104.8,8.7330000000000005,4.9000000000000004,9.4499999999999993,11.85,11.25,13.6,14.15,null,7,"B",3.25,7,14.15,9.9499999999999993,null,null,-1.75,null,"Free Agent (O)",9,null,null,"Manningham, Mario SFO WR"]
[814,814,"Mare, Olindo CHI PK",21.5,7.1669999999999998,null,null,null,null,null,"B",null,null,null,null,null,null,null,null,7,1,13.5,"Free Agent",6,null,null,"Mare, Olindo CHI PK"]
[815,815,"Marecic, Owen CLE RB",0,0,0,0,0,0,0,0,0,null,null,"B",null,null,0,null,null,0,0,"Free Agent",10,null,null,"Marecic, Owen CLE RB"]
[816,816,"Marks, Sen'Derrick TEN DT",111.45,7.9610000000000003,null,null,12.5,1.75,4.25,8.75,0,5,10,11.8,"B",7.5,12.5,8.75,11.5,5,12.15,"Free Agent",11,null,null,"Marks, Sen'Derrick TEN DT"]
[817,817,"Marsh, Curtis PHI CB",10,0.66700000000000004,0,null,0,0,0,1.5,"B",0,1.5,1.5,0,0,1.5,4,0,0,0,"Free Agent",7,null,null,"Marsh, Curtis PHI CB"]
[818,818,"Marshall, Brandon CHI WR",367.6,22.975000000000001,29.15,4.9000000000000004,13.35,28.55,35.4,"B",21.6,21.05,41.45,21.7,10.6,24.2,31.3,37.700000000000003,16.100000000000001,20.3,10.25,"Derek's Daycare ",6,null,null,"Marshall, Brandon CHI WR"]
[819,819,"Marshall, Brandon JAC LB",0,0,0,0,0,null,0,"B",null,null,null,null,null,null,null,null,null,null,0,"Free Agent",6,null,null,"Marshall, Brandon JAC LB"]
[820,820,"Marshall, Richard MIA CB",43.7,10.925000000000001,10,4.5,20.7,8.5,null,null,"B",null,null,null,null,null,null,null,null,null,null,"Free Agent",7,null,null,"Marshall, Richard MIA CB"]
[821,821,"Martin, Charly SEA WR",9.1999999999999993,2.2999999999999998,2.75,null,2.25,null,null,null,null,4.2,0,null,"B",null,null,null,null,null,null,"Free Agent",11,null,null,"Martin, Charly SEA WR"]
[822,822,"Martin, Derrick NEP S",9.4,1.88,null,null,null,null,null,null,null,null,"B",0,0,1.5,null,null,null,0,7.9,"Free Agent",9,null,null,"Martin, Derrick NEP S"]
[823,823,"Martin, Doug TBB RB",337.75,21.109000000000002,15.8,12.6,9.4,6.2,"B",16.100000000000001,21.2,38.4,70.75,15.9,19.86,20.3,12.8,23.2,6.5,18.899999999999999,29.84,"Rancho Cucamonga Ghosts (P)",5,null,null,"Martin, Doug TBB RB"]
[824,824,"Martin, Keshawn HOU WR",77.760000000000005,4.8600000000000003,0,0,6.6,4.4000000000000004,1.4,8.77,-0.72,"B",4.8499999999999996,2.64,19.7,11.41,5.03,2.48,1.52,4.43,5.25,"Free Agent",8,null,null,"Martin, Keshawn HOU WR"]
[825,825,"Martin, Mike TEN DT",93.45,5.8410000000000002,5,13.9,11,1.25,16,11,2.5,0,2.5,2.5,"B",2.5,5,4.75,1.25,14.3,0,"Free Agent",11,null,null,"Martin, Mike TEN DT"]
[826,826,"Martin, Ruvell BUF WR",9.1,0.65,0,0,null,null,0,0,0,"B",0,0,0,0,0,0,2.0499999999999998,4.7,2.35,"Free Agent",8,null,null,"Martin, Ruvell BUF WR"]
[827,827,"Martin, Sherrod CAR S",38.25,3.1880000000000002,0,0,0,0,6.75,"B",1.5,1.5,5.5,5.25,0,17.75,0,null,null,null,null,"Free Agent",6,null,null,"Martin, Sherrod CAR S"]
[828,828,"Martin, Vaughn SDC DE",47.85,3.988,2.5,0,19.850000000000001,5.5,3.75,0,"B",1.25,2.5,0,2.5,7.5,2.5,null,null,null,null,"Free Agent",7,null,null,"Martin, Vaughn SDC DE"]
[829,829,"Massaquoi, Jonathan ATL DE",0,0,null,null,null,null,null,null,"B",0,null,0,0,0,0,0,0,0,0,"Free Agent",7,null,null,"Massaquoi, Jonathan ATL DE"]
[830,830,"Massaquoi, Mohamed CLE WR",48.65,5.4059999999999997,7.85,15.25,3.65,null,null,null,null,null,1.85,"B",0,6.45,9.5,0,4.0999999999999996,null,null,"Free Agent",10,null,null,"Massaquoi, Mohamed CLE WR"]
[831,831,"Mastrud, Jeron MIA TE",0,0,0,0,0,0,0,0,"B",0,0,null,null,0,0,0,0,0,0,"Free Agent",7,null,null,"Mastrud, Jeron MIA TE"]
[832,832,"Mathews, Ricardo IND DE",27.5,1.7190000000000001,0,0,2.5,"B",0,2.5,1.25,0,2.5,2.5,1.25,1.25,6.25,0,0,2.5,5,"Free Agent",4,null,null,"Mathews, Ricardo IND DE"]
[833,833,"Mathews, Ryan SDC RB",134.9,11.242000000000001,null,null,9.6,10.199999999999999,25.9,13.3,"B",9.4,9.1999999999999993,12.6,12.3,11.8,8.1,6.5,6,null,null,"The Black Champion",7,null,null,{"$f":"IF(ISBLANK(C843),\"\",C843)","v":"Mathews, Ryan SDC RB"}]
[834,834,"Mathis, Rashean JAC CB",42.5,3.5419999999999998,4,3,7,5.5,13,"B",0,null,null,null,null,4,0,0,3,3,0,"Free Agent",6,null,null,"Mathis, Rashean JAC CB"]
[835,835,"Mathis, Robert IND LB",110.25,9.1880000000000006,22.4,14.1,13.45,"B",8.1,null,null,null,9.9,null,1.5,9.9,9.1,4.5,9.8000000000000007,3,4.5,"Free Agent",4,null,null,"Mathis, Robert IND LB"]
[836,836,"Matthews, Casey PHI LB",8.75,0.54700000000000004,0,0,0,0,2.25,0,"B",5,0,0,0,0,1.5,0,0,0,0,"Free Agent (Q)",7,null,null,"Matthews, Casey PHI LB"]
[837,837,"Matthews, Clay GBP LB",155.55000000000001,12.962,20.149999999999999,34.65,2.25,14.5,12,7,9.9,6.25,0,"B",null,null,null,null,26.15,11.5,11.2,"Roddy White Man Can't Jump",10,null,null,"Matthews, Clay GBP LB"]
[838,838,"Matthews, Cliff ATL DE",7.5,0.75,2.5,null,null,0,null,null,"B",null,0,0,0,0,5,0,0,null,0,"Free Agent",7,null,null,"Matthews, Cliff ATL DE"]
[839,839,"Matthews, Rishard MIA WR",28.85,3.6059999999999999,null,0,null,null,null,null,"B",null,null,null,3.15,0,4.05,2.0499999999999998,6.05,6.2,7.35,"Free Agent",7,null,null,"Matthews, Rishard MIA WR"]
[840,840,"Maualuga, Rey CIN LB",158,9.875,8.5,10.75,15,7.5,11.25,7.5,9.5,"B",7.5,14.5,13.5,8.5,10.5,11.5,5.5,6,10.5,"Free Agent",8,null,null,"Maualuga, Rey CIN LB"]
[841,841,"Mauga, Josh NYJ LB",3.75,0.75,0,0,0,0,3.75,null,null,null,"B",null,null,null,null,null,null,null,null,"Free Agent",9,null,null,"Mauga, Josh NYJ LB"]
[842,842,"Maybin, Aaron FA LB",1.5,0.188,0,0,0,1.5,0,0,0,0,null,null,null,null,null,null,null,null,null,"Free Agent","-",null,null,"Maybin, Aaron FA LB"]
[843,843,"Mayo, Jerod NEP LB",226.4,14.15,19,9.75,15,15,20.2,13,18.75,13.5,"B",12,9.25,21.15,18.55,11.25,12.75,8.25,9,"Polk High",9,null,null,"Mayo, Jerod NEP LB"]
[844,844,"Mays, Joe DEN LB",22.8,3.8,5.55,6,3,null,8.25,0,"B",0,null,null,null,null,null,null,null,null,null,"Free Agent",7,null,null,"Mays, Joe DEN LB"]
[845,845,"Mays, Taylor CIN S",23.5,1.4690000000000001,5.25,0,0.75,3,0,0,0,"B",1.5,1.5,4.5,0,0,0,2.5,0,4.5,"Free Agent",8,null,null,"Mays, Taylor CIN S"]
[846,846,"McBath, Darcel SFO S",5.5,0.34399999999999997,0,0,0,0,1.5,0,0,0,"B",2.5,0,0,0,0,0,0,1.5,"Free Agent",9,null,null,"McBath, Darcel SFO S"]
[847,847,"McBride, Turk NOS DE",15,2.1429999999999998,0,null,null,null,null,"B",null,5,null,2.5,2.5,2.5,0,null,null,null,2.5,"Free Agent",6,null,null,"McBride, Turk NOS DE"]
[848,848,"McCain, Brice HOU CB",62.5,5.2080000000000002,5.25,0,4,1.5,21.75,5.5,5.75,"B",7,0,5.5,3.75,2.5,null,null,null,null,"Free Agent",8,null,null,"McCain, Brice HOU CB"]
[849,849,"McCarthy, Colin TEN LB",67.650000000000006,9.6639999999999997,4.5,null,null,null,6,8.25,null,17,6,22.9,"B",3,null,null,null,null,null,"Roddy White Man Can't Jump (Q)",11,null,null,"McCarthy, Colin TEN LB"]
[850,850,"McClain, Jameel BAL LB",114.5,8.8079999999999998,4.75,7.5,1.5,9.25,12.5,11.25,7.75,"B",8.5,12.75,11.25,9.75,8.75,9,null,null,null,"Free Agent (O)",8,null,null,"McClain, Jameel BAL LB"]
[851,851,"McClain, Le'Ron SDC RB",15.1,0.94399999999999995,6,1.9,0,1.2,0,0,"B",0.5,0,0.5,0,0,4.5999999999999996,0.4,0,0,0,"Free Agent",7,null,null,"McClain, Le'Ron SDC RB"]
[852,852,"McClain, Robert ATL CB",117.7,7.8470000000000004,null,10.7,0,4.5,3,7.25,"B",11.5,7.5,8.5,12.25,5.5,13.25,11.25,5.25,11.75,5.5,"Free Agent",7,null,null,"McClain, Robert ATL CB"]
[853,853,"McClain, Rolando OAK LB",85.45,7.7679999999999998,6.75,3,9,11,"B",4.75,7.25,15.7,8.25,3,10.75,6,null,null,null,null,null,"Free Agent",5,null,null,"McClain, Rolando OAK LB"]
[854,854,"McClain, Terrell HOU DT",0,0,null,null,null,0,null,null,null,"B",null,null,0,0,0,null,null,null,null,"Free Agent",8,null,null,"McClain, Terrell HOU DT"]
[855,855,"McClellan, Albert BAL LB",77.349999999999994,5.5250000000000004,3,14.25,1.5,11.75,2.25,3.75,0.75,"B",0.75,8,4,1.5,6.75,3.75,15.35,null,null,"Free Agent (P)",8,null,null,"McClellan, Albert BAL LB"]
[856,856,"McClellin, Shea CHI DE",48.9,3.4929999999999999,0,15.85,4.75,0,0,"B",7.75,3.5,1.25,0,null,7.05,6.25,0,null,0,2.5,"Free Agent",6,null,null,"McClellin, Shea CHI DE"]
[857,857,"McCluster, Dexter KCC WR",117.6,7.35,15.7,8.1999999999999993,4.05,3.1,0,11.4,"B",20.399999999999999,2.9,4.3,7.45,9.4,4.5,2.0499999999999998,14.65,7.75,1.75,"Free Agent",7,null,null,"McCluster, Dexter KCC WR"]
[858,858,"McCourty, Devin NEP CB",206.71,12.919,15.12,4.84,20.71,27.7,6.92,9.75,21.46,3.76,"B",20.94,14.51,12.41,4.91,16.899999999999999,14.03,6.75,6,"Klingon Warriors",9,null,null,"McCourty, Devin NEP CB"]
[859,859,"McCourty, Jason TEN CB",193.21,12.076000000000001,4,6.75,10,10,14.5,15.25,14.25,8,8.25,21.5,"B",5.81,10,9.25,23.9,12,19.75,"Polk High",11,null,null,"McCourty, Jason TEN CB"]
[860,860,"McCown, Luke ATL QB",-0.3,-0.15,null,null,0,null,null,null,"B",null,null,null,null,null,null,null,-0.3,null,null,"Free Agent",7,null,null,"McCown, Luke ATL QB"]
[861,861,"McCoy, Anthony SEA TE",78.099999999999994,4.8810000000000002,0,17.600000000000001,2.4,5,0,0,0,5.7,0,0,"B",11.3,2.6,17,0,8.1,8.4,"Free Agent (I)",11,null,null,"McCoy, Anthony SEA TE"]
[862,862,"McCoy, Colt CLE QB",5.66,1.887,null,null,null,null,null,null,null,null,null,"B",null,0,null,-0.2,null,5.86,null,"Free Agent",10,null,null,"McCoy, Colt CLE QB"]
[863,863,"McCoy, Gerald TBB DT",115.25,7.2030000000000003,12.8,7.5,25.65,8.5,"B",2.5,7.5,2.5,1.25,1.25,6,2,10,26.05,1.75,0,0,"Free Agent",5,null,null,"McCoy, Gerald TBB DT"]
[864,864,"McCoy, Jamie PIT TE",0,0,null,null,null,"B",null,null,null,null,null,null,null,null,null,null,null,null,0,"Free Agent",4,null,null,"McCoy, Jamie PIT TE"]
[865,865,"McCoy, LeSean PHI RB",197.3,16.442,17.600000000000001,13.9,10.8,16,18,17.8,"B",21.7,15.3,14.2,15.2,null,null,null,null,21.2,15.6,"Hurry Up and Happy Birthday, Donny",7,null,null,"McCoy, LeSean PHI RB"]
[866,866,"McCray, Danny DAL S",90.5,6.0330000000000004,null,6.75,0,7.5,"B",6.75,4.5,11.25,8.25,4.5,9,1.5,16.25,6,7.5,0,0.75,"Free Agent",5,null,null,"McCray, Danny DAL S"]
[867,867,"McDaniel, Tony MIA DT",29.05,2.641,0,null,null,null,5.75,0,"B",1.25,null,3.75,null,4.55,5,2.5,0,5,1.25,"Free Agent",7,null,null,"McDaniel, Tony MIA DT"]
[868,868,"McDonald, Brandon TBB CB",38.75,3.5230000000000001,2.25,21.5,4.5,2.25,"B",3,5.25,0,0,null,null,null,null,null,0,0,0,"Free Agent",5,null,null,"McDonald, Brandon TBB CB"]
[869,869,"McDonald, Clinton SEA DT",57,4.0709999999999997,6,5,6.25,5,0,null,5,5,3.75,null,"B",0,6.25,6,1.25,6.25,1.25,"Free Agent",11,null,null,"McDonald, Clinton SEA DT"]
[870,870,"McDonald, Ray SFO DE",109,6.8120000000000003,8.75,7.65,2.5,6.25,0,0,3.75,9.5,"B",7.5,12,5,2.5,5,23.1,7.5,8,"Free Agent",9,null,null,"McDonald, Ray SFO DE"]
[871,871,"McElroy, Greg NYJ QB",-0.44,-0.22,null,null,null,null,null,null,null,null,"B",null,null,null,6.66,null,null,-7.1,null,"Free Agent (P)",9,null,null,"McElroy, Greg NYJ QB"]
[872,872,"McFadden, Darren OAK RB",151.5,12.625,24.8,6.1,20.5,4.8,"B",15.8,12.1,17.7,3.7,null,null,null,null,14.4,15.9,7.8,7.9,"Invictus",5,null,null,"McFadden, Darren OAK RB"]
[873,873,"McGahee, Willis DEN RB",134.19999999999999,13.42,4.4000000000000004,26.4,5.2,25.5,12.2,13.8,"B",20.5,8,9.9,8.3000000000000007,null,null,null,null,null,null,"Free Agent",7,null,null,"McGahee, Willis DEN RB"]
[874,874,"McGee, Terrence BUF CB",15.5,2.214,1.5,8.5,4,0,1.5,0,0,"B",null,null,null,null,null,null,null,null,null,"Free Agent",8,null,null,"McGee, Terrence BUF CB"]
[875,875,"McIntosh, Roger STL LB",73.75,4.609,2.25,2.5,5.25,17.649999999999999,0,1.5,3,0,"B",1.5,9.5,14.1,9,0.75,1.5,0.75,4.5,"Free Agent",9,null,null,"McIntosh, Roger STL LB"]
[876,876,"McIntyre, Corey BUF RB",2.9,0.18099999999999999,0,0,1.9,0,0,0,0,"B",0,1,0,0,0,0,0,0,0,"Free Agent",8,null,null,"McIntyre, Corey BUF RB"]
[877,877,"McIntyre, Garrett NYJ LB",65.2,4.0750000000000002,0,23.55,4.75,2.25,0,0,0,0,"B",3.75,4,1.5,0,0,11.5,7.9,6,"Free Agent",9,null,null,"McIntyre, Garrett NYJ LB"]
[878,878,"McKelvin, Leodis BUF CB",103.78,7.9829999999999997,9.14,12.53,13.29,1.04,4.2300000000000004,6.87,3,"B",8.4499999999999993,9.34,17.03,7.6,0.8,10.46,null,null,null,"Free Agent (Q)",8,null,null,"McKelvin, Leodis BUF CB"]
[879,879,"McKenzie, Tyrone MIN LB",4.5,0.28100000000000003,0,0,0,0,1.5,0,3,0,0,0,"B",0,0,0,0,0,0,"Free Agent",11,null,null,"McKenzie, Tyrone MIN LB"]
[880,880,"McKnight, Joe NYJ RB",65.58,4.3719999999999999,1.26,5.68,2.38,2.92,12.14,9.4600000000000009,6.94,0.96,"B",null,5.88,4.32,1.88,0,3.98,5.58,2.2000000000000002,"Free Agent (Q)",9,null,null,"McKnight, Joe NYJ RB"]
[881,881,"McLeod, Rodney STL S",0,0,0,0,0,0,0,0,0,0,"B",0,0,0,0,0,0,0,0,"Free Agent",9,null,null,"McLeod, Rodney STL S"]
[882,882,"McManis, Sherrick CHI CB",2,0.16700000000000001,0,0,0,0,0,"B",null,0,2,0,0,0,0,0,null,null,null,"Free Agent (P)",6,null,null,"McManis, Sherrick CHI CB"]
[883,883,"McMichael, Randy SDC TE",17.600000000000001,1.1000000000000001,0,9.4,2,0,0,0.6,"B",0,0,1.5,0,4.0999999999999996,0,0,0,0,0,"Free Agent",7,null,null,"McMichael, Randy SDC TE"]
[884,884,"McMillian, Jerron GBP S",49,3.0619999999999998,1.5,9.5,2.5,1.5,0,3,0.75,3,7.75,"B",11.25,1.5,2.25,1.5,0,0,3,"Free Agent",10,null,null,"McMillian, Jerron GBP S"]
[885,885,"McNeill, Mike STL TE",9.1,0.65,2.5,0,0,0,0,0,0,4.2,"B",0,2.4,0,0,null,null,0,0,"Free Agent",9,null,null,"McNeill, Mike STL TE"]
[886,886,"McNutt, Marvin PHI WR",0,0,null,null,null,null,null,null,"B",null,null,null,null,null,null,0,0,0,0,"Free Agent",7,null,null,"McNutt, Marvin PHI WR"]
[887,887,"McPhee, Pernell BAL DE",42.45,3.5379999999999998,4.3499999999999996,4.5,2.25,4.5,6.5,6,0,"B",null,null,null,null,1.5,3.25,8.1,1.5,0,"Free Agent",8,null,null,"McPhee, Pernell BAL DE"]
[888,888,"Mclendon, Steve PIT DT",31.45,1.966,0,3.75,0,"B",11.7,0,0,0,0,0,0,3.5,3.5,0,0,4.55,4.45,"Free Agent",4,null,null,"Mclendon, Steve PIT DT"]
[889,889,"Meachem, Robert SDC WR",51.6,3.44,8.4,0,9.3000000000000007,0,23.45,6.75,"B",-0.6,null,2.0499999999999998,2.25,0,0,0,0,0,0,"Free Agent",7,null,null,"Meachem, Robert SDC WR"]
[890,890,"Mebane, Brandon SEA DT",141.44999999999999,8.8409999999999993,14.5,2.5,21.75,14.5,8.75,13,2.5,21.45,5,7.5,"B",10,5,5,2.5,1.25,6.25,"Free Agent",11,null,null,"Mebane, Brandon SEA DT"]
[891,891,"Medlock, Justin FA PK",43,4.3,4,5,1,4,4,null,2,17,3,1,2,null,null,null,null,null,null,"Free Agent","-",null,null,"Medlock, Justin FA PK"]
[892,892,"Melton, Henry CHI DT",143.80000000000001,10.271000000000001,26.35,16.899999999999999,5,11.7,4.45,"B",10.5,19,2.5,14.5,0,11.9,12.25,3.75,null,null,5,"Polk High (Q)",6,null,null,"Melton, Henry CHI DT"]
[893,893,"Mendenhall, Rashard PIT RB",34.4,5.7329999999999997,null,null,null,"B",18.100000000000001,2.7,null,null,null,null,8,-3.4,null,null,null,5,4,"Klingon Warriors",4,null,null,"Mendenhall, Rashard PIT RB"]
[894,894,"Mercilus, Whitney HOU LB",75.45,4.7160000000000002,0,0,0,1.5,0,1.5,13.2,"B",18.95,1.5,0,7.5,18.100000000000001,9.6999999999999993,1.5,1.25,0.75,"Free Agent (P)",8,null,null,"Mercilus, Whitney HOU LB"]
[895,895,"Meriweather, Brandon WAS S",20,20,null,null,null,null,null,null,null,null,null,"B",20,null,null,null,null,null,null,"Free Agent (Q)",10,null,null,"Meriweather, Brandon WAS S"]
[896,896,"Merling, Phillip WAS DE",3.75,1.25,0,2.5,1.25,null,null,null,null,null,null,"B",null,null,null,null,null,null,null,"Free Agent",10,null,null,"Merling, Phillip WAS DE"]
[897,897,"Merriman, Shawne BUF DE",45.1,4.51,null,null,null,null,null,null,0,"B",0,0,12.1,2.5,2.5,2.5,2.5,7.5,15.5,"Free Agent",8,null,null,{"$f":"IF(ISBLANK(C907),\"\",C907)","v":"Merriman, Shawne BUF DE"}]
[898,898,"Middleton, William JAC CB",26.5,2.944,3,7.5,7.75,0,null,"B",0,8.25,0,0,0,null,null,null,null,null,null,"Free Agent",6,null,null,"Middleton, William JAC CB"]
[899,899,"Mikell, Quintin STL S",167,10.438000000000001,10.5,3,7.5,7.5,3,9.5,8.25,4.5,"B",14,21.6,6.25,7.5,12.25,17.100000000000001,25.55,9,"Free Agent",9,null,null,"Mikell, Quintin STL S"]
[900,900,"Miles, Jeromy CIN S",21.25,1.3280000000000001,3.75,10,0,0,0,0,0,"B",0,0,1.5,0,0,0,0,0,6,"Free Agent",8,null,null,"Miles, Jeromy CIN S"]
[901,901,"Miller, Brit FA RB",-1.48,-0.16400000000000001,0,0,0,0,0,-2.48,0,0,null,1,null,null,null,null,null,null,null,"Free Agent","-",null,null,"Miller, Brit FA RB"]
[902,902,"Miller, Bruce SFO RB",23.2,1.45,2.5,0,0,2.4,0.9,0,0,0.1,"B",1,0,6.7,3.7,2.1,0,1.9,1.9,"Free Agent",9,null,null,"Miller, Bruce SFO RB"]
[903,903,"Miller, Heath PIT TE",240.1,16.007000000000001,17,12.4,30,"B",10.1,15.7,22.3,16.600000000000001,10.8,10.7,5.2,15.3,25.2,14.1,25.7,9,null,"I like my Women like I like my coffee, _______. (O)",4,null,null,"Miller, Heath PIT TE"]
[904,904,"Miller, Lamar MIA RB",41.5,3.1920000000000002,null,12.5,4.8,1.3,0,0,"B",null,0.7,4.5,0,null,0,1.9,3,7.3,5.5,"The Black Champion",7,null,null,"Miller, Lamar MIA RB"]
[905,905,"Miller, Roy TBB DT",53.5,3.5670000000000002,5,3.75,8.5,2.5,"B",5,4.25,3.5,0,5,6.75,2.5,0,null,0,2.5,4.25,"Free Agent",5,null,null,"Miller, Roy TBB DT"]
[906,906,"Miller, Von DEN LB",265.75,16.609000000000002,21.5,12.6,2.75,7.25,32.450000000000003,10.35,"B",2.5,27.3,21.6,36.9,9.1,34.049999999999997,15.25,3.75,16.95,11.45,"BELAC",7,null,null,"Miller, Von DEN LB"]
[907,907,"Miller, Zach SEA TE",111.6,6.9749999999999996,8.5,2.2000000000000002,4.2,7.7,10.4,2.9,0,11.2,7.7,11.2,"B",6.1,3.7,11.9,13.1,4.5,6.3,"Polk High (P)",11,null,null,"Miller, Zach SEA TE"]
[908,908,"Mincey, Jeremy JAC DE",140.4,8.7750000000000004,7.25,16,2.5,20.75,0,"B",16.8,17.95,5,12,1.25,2.5,12.25,2.5,2.5,17.399999999999999,3.75,"Free Agent",6,null,null,"Mincey, Jeremy JAC DE"]
[909,909,"Misi, Koa MIA LB",117.25,8.375,15.75,4.5,12,17.100000000000001,8.25,3,"B",6.25,1.5,9.5,9.1999999999999993,9.25,13.45,6,null,null,1.5,"Free Agent",7,null,null,"Misi, Koa MIA LB"]
[910,910,"Mitchell, Charles ATL S",0.75,7.4999999999999997E-2,null,null,0,0,0.75,0,"B",0,0,null,null,null,null,0,0,0,0,"Free Agent",7,null,null,"Mitchell, Charles ATL S"]
[911,911,"Mitchell, Earl HOU DT",75,4.6879999999999997,0,2.5,7.5,6.25,3.75,11.25,1.25,"B",2.5,8.75,2.5,4.25,2.5,9.75,2.5,2.5,7.25,"Free Agent",8,null,null,"Mitchell, Earl HOU DT"]
[912,912,"Mitchell, Marvin MIN LB",8.5,0.77300000000000002,null,null,4,1.5,null,null,0,0,0,null,"B",0,0,0,3,0,0,"Free Agent",11,null,null,"Mitchell, Marvin MIN LB"]
[913,913,"Mitchell, Michael OAK S",49.23,3.077,0,0,1.5,0,"B",0,0,3,0,0,12,0,4.5,16.100000000000001,1.5,5.38,5.25,"Free Agent",5,null,null,"Mitchell, Michael OAK S"]
[914,914,"Moala, Fili IND DE",24.5,3.0619999999999998,0,1.75,7.25,"B",0,null,null,null,3.75,0,3,8.75,null,null,null,null,null,"Free Agent (O)",4,null,null,"Moala, Fili IND DE"]
[915,915,"Moats, Arthur BUF LB",24.25,1.732,6.75,3,9.25,1.5,3,0,0,"B",0,0.75,0,0,0,0,0,null,null,"Free Agent",8,null,null,"Moats, Arthur BUF LB"]
[916,916,"Moch, Dontay CIN LB",0,0,null,null,null,null,null,0,null,"B",null,null,null,null,null,null,null,null,null,"Free Agent",8,null,null,"Moch, Dontay CIN LB"]
[917,917,"Moeaki, Tony KCC TE",101.8,6.7869999999999999,8.1999999999999993,2.4,4.2,6.3,0,3.3,"B",12.7,0,11.3,13.3,7,17.399999999999999,2.5,8.1,null,5.0999999999999996,"Free Agent",7,null,null,"Moeaki, Tony KCC TE"]
[918,918,"Moore, D.J. CHI CB",68.45,5.2649999999999997,8,3,6,21.75,5.5,"B",7.7,1.5,3,null,null,0,null,0,10.5,0,1.5,"Free Agent (P)",6,null,null,"Moore, D.J. CHI CB"]
[919,919,"Moore, Denarius OAK WR",176.48,11.765000000000001,null,10.45,16.75,12.1,"B",23.65,12.6,22.85,11.6,20,1.65,9.25,5.6,9.83,7.85,4.95,7.35,"Angry Neighbors",5,null,null,"Moore, Denarius OAK WR"]
[920,920,"Moore, Evan PHI TE",2.1,0.14000000000000001,0,0,0,0,0,0,"B",0,0,0,null,2.1,0,0,0,0,null,"Free Agent",7,null,null,"Moore, Evan PHI TE"]
[921,921,"Moore, Kyle BUF DE",68.5,5.7080000000000002,null,null,null,null,0,0,0,"B",9.3000000000000007,5,12,5,11.7,8,5,5,7.5,"Free Agent",8,null,null,"Moore, Kyle BUF DE"]
[922,922,"Moore, Lance NOS WR",223.68,14.912000000000001,25.5,5.5,18,15.45,null,"B",23.35,6.25,8.93,17.850000000000001,19.8,10.85,21.05,3.85,15.2,14,18.100000000000001,"Hurry Up and Happy Birthday, Donny",6,null,null,"Moore, Lance NOS WR"]
[923,923,"Moore, Marlon MIA WR",26,1.857,0,0,null,null,0,14.35,"B",4.95,0,0,0,0.9,0,0,5.8,0,0,"Free Agent",7,null,null,"Moore, Marlon MIA WR"]
[924,924,"Moore, Matt MIA QB",7.94,3.97,null,null,null,null,null,null,"B",8.84,null,-0.9,null,null,null,null,null,null,null,"Free Agent",7,null,null,"Moore, Matt MIA QB"]
[925,925,"Moore, Mewelde IND RB",20.7,2.2999999999999998,2.38,1.6,7.4,"B",null,0.5,2.06,3.06,null,null,null,null,null,null,-2.4,4.2,1.9,"Free Agent",4,null,null,"Moore, Mewelde IND RB"]
[926,926,"Moore, Rahim DEN S",132.1,8.2560000000000002,7.75,8.25,13.5,8.25,13.5,4.5,"B",5,4.5,15.05,3.75,4.5,4.75,8.5,5.5,5.5,19.3,"Free Agent",7,null,null,"Moore, Rahim DEN S"]
[927,927,"Moore, Sterling DAL CB",40.5,3.1150000000000002,0,1.5,1.5,1.5,"B",0,1.5,11.5,null,null,null,null,0.75,2.25,3,5.5,2.25,"Free Agent",5,null,null,"Moore, Sterling DAL CB"]
[928,928,"Moore, William ATL S",164.15,13.679,19.2,30.35,14.75,7.5,9.75,10.75,"B",9.25,5.25,7.5,8.5,8.25,33.1,null,null,null,null,"I like my Women like I like my coffee, _______.",7,null,null,"Moore, William ATL S"]
[929,929,"Moreno, Knowshon DEN RB",111.5,13.938000000000001,7.3,-0.6,null,null,null,null,"B",null,null,null,null,15.1,12.3,26.7,20.6,17.7,12.4,"Free Agent (P)",7,null,null,"Moreno, Knowshon DEN RB"]
[930,930,"Morgan, Derrick TEN DE",185.6,11.6,17.25,20.75,3.75,13,1.25,16.45,11.25,11.2,10.5,11,"B",5,7.5,14.3,12.95,7.5,21.95,"Klingon Warriors",11,null,null,"Morgan, Derrick TEN DE"]
[931,931,"Morgan, Joseph NOS WR",72.5,5.1790000000000003,0,1.75,null,16.25,0,"B",13.05,null,0,0,0,4.55,5.05,15.1,14.6,0,2.15,"Free Agent (O)",6,null,null,"Morgan, Joseph NOS WR"]
[932,932,"Morgan, Josh WAS WR",131.80000000000001,8.2379999999999995,3.35,11.25,4.7,11.2,1.65,7.95,2.1,11.75,13,"B",6.25,11.05,12.5,12.75,11,11.3,0,"Free Agent (P)",10,null,null,"Morgan, Josh WAS WR"]
[933,933,"Morgan, Michael SEA LB",14.5,0.90600000000000003,0,0,0,3,0,0,0,0,4.75,6,"B",0,0,0.75,0,0,0,"Free Agent",11,null,null,"Morgan, Michael SEA LB"]
[934,934,"Morris, Alfred WAS RB",253.7,15.856,21.6,8.9,13.8,17.899999999999999,14.5,12.6,12,5.9,7.6,"B",9.3000000000000007,17.3,9.4,16.600000000000001,23.3,17.8,45.2,"BELAC",10,null,null,"Morris, Alfred WAS RB"]
[935,935,"Morrison, Kirk BUF LB",0,0,null,null,null,null,null,0,null,"B",null,null,null,null,null,null,null,0,0,"Free Agent",8,null,null,"Morrison, Kirk BUF LB"]
[936,936,"Moses, Dezman GBP LB",60.5,3.7810000000000001,0,0,0,0,0,2.25,7.5,0,4.5,"B",10.6,17.350000000000001,4.5,3,3,7.8,0,"Free Agent",10,null,null,"Moses, Dezman GBP LB"]
[937,937,"Mosley, C.J. JAC DT",130.85,8.1780000000000008,4.5,11,0,4.5,12.25,"B",9.5,5,3.75,5,34.549999999999997,2.5,17.5,7.5,7.5,4.55,1.25,"Free Agent",6,null,null,"Mosley, C.J. JAC DT"]
[938,938,"Moss, Randy SFO WR",98.4,6.15,15.7,2.65,6.45,0,2.35,11,2.65,12.95,"B",4.4000000000000004,2.4500000000000002,0,6.75,5.5,12.1,8.15,5.3,"Free Agent",9,null,null,"Moss, Randy SFO WR"]
[939,939,"Moss, Santana WAS WR",154.55000000000001,9.6590000000000007,8.4499999999999993,5.15,7.55,7.05,17.5,9.6,19.45,13.1,1.45,"B",14.35,15.2,0,8.9499999999999993,8.9499999999999993,12.9,4.9000000000000004,"Free Agent",10,null,null,"Moss, Santana WAS WR"]
[940,940,"Mouton, Jonas SDC LB",0,0,null,null,null,null,null,null,"B",null,null,null,null,null,0,0,0,null,null,"Free Agent (I)",7,null,null,"Mouton, Jonas SDC LB"]
[941,941,"Mouton, Ryan TEN CB",63.25,4.8650000000000002,6.75,0.75,11.25,1.5,7.25,2.25,10.5,10,4,3,"B",3,null,3,0,null,null,"Free Agent",11,null,null,"Mouton, Ryan TEN CB"]
[942,942,"Muckelroy, Roddrick WAS LB",2.5,0.5,null,0,2.5,null,0,0,0,null,null,"B",null,null,null,null,null,null,null,"Free Agent",10,null,null,"Muckelroy, Roddrick WAS LB"]
[943,943,"Muir, Daniel KCC DT",5,1.667,null,null,null,null,null,2.5,"B",2.5,null,null,null,null,null,null,null,null,null,"Free Agent",7,null,null,"Muir, Daniel KCC DT"]
[944,944,"Mulligan, Matthew STL TE",26.4,1.65,0,10.4,2.7,0,0,4.5,0,3.3,"B",0,0,3,0,0,0,0,2.5,"Free Agent",9,null,null,"Mulligan, Matthew STL TE"]
[945,945,"Mundy, Ryan PIT S",42.25,2.641,6.25,9.25,7,"B",6.75,0,0,6,3,1.5,2.5,0,0,0,0,0,0,"Free Agent",4,null,null,"Mundy, Ryan PIT S"]
[946,946,"Munnerlyn, Captain CAR CB",139.93,8.7460000000000004,6.25,3.75,4.75,7.53,22.1,"B",1.77,8.5,10.28,5.92,27.33,4.5,4.5,7.5,3,6.75,15.5,"Free Agent",6,null,null,"Munnerlyn, Captain CAR CB"]
[947,947,"Murphy, Jerome WAS CB",2.25,0.28100000000000003,2.25,0,0,null,null,null,null,null,null,"B",null,null,0,0,0,0,0,"Free Agent",10,null,null,"Murphy, Jerome WAS CB"]
[948,948,"Murphy, Louis CAR WR",77.150000000000006,4.8220000000000001,11.05,0,1.95,2.0499999999999998,2.0499999999999998,"B",8.5500000000000007,7,1.65,0,2.4500000000000002,10,8.0500000000000007,6.85,4.3,1.75,9.4499999999999993,"Free Agent",6,null,null,"Murphy, Louis CAR WR"]
[949,949,"Murphy, Richard JAC RB",13.92,2.7839999999999998,null,null,null,null,null,"B",null,null,null,null,null,null,0,1.9,2.96,5.7,3.36,"Free Agent",6,null,null,"Murphy, Richard JAC RB"]
[950,950,"Murray, DeMarco DAL RB",145.4,14.54,17,11.5,14.5,15.1,"B",10.7,null,null,null,null,null,null,20.2,17.5,18.2,10.1,10.6,"Aaron Hernandez's Pistol Offense",5,null,null,"Murray, DeMarco DAL RB"]
[951,951,"Myers, Brandon OAK TE",223.1,13.944000000000001,14,17.600000000000001,11.5,3.7,"B",13.7,14.9,9.4,29.9,13.2,20.5,11.2,40,2.2000000000000002,4.5,5.5,11.3,"Roddy White Man Can't Jump",5,null,null,"Myers, Brandon OAK TE"]
[952,952,"Naanee, Legedu FA WR",0.15,3.6999999999999998E-2,0,0,0,0.15,null,null,null,null,null,null,null,null,null,null,null,null,null,"Free Agent","-",null,null,"Naanee, Legedu FA WR"]
[953,953,"Nading, Jesse HOU LB",0,0,0,0,0,0,0,0,0,"B",0,0,0,0,0,0,0,0,0,"Free Agent",8,null,null,"Nading, Jesse HOU LB"]
[954,954,"Nakamura, Haruki CAR S",79.650000000000006,6.1269999999999998,4.5,6.75,5.25,18.100000000000001,4.5,"B",3.25,3,5.25,0,17.8,0.75,7.5,3,null,null,null,"Free Agent",6,null,null,"Nakamura, Haruki CAR S"]
[955,955,"Neal, Mike GBP DE",55.25,5.0229999999999997,null,null,null,null,9.4,5,1.25,0,13,"B",0,0,1.25,null,13.65,11.7,0,"Free Agent (O)",10,null,null,"Neal, Mike GBP DE"]
[956,956,"Neblett, Andre CAR DT",18.600000000000001,1.6910000000000001,null,null,null,null,null,"B",0,0,0,1.25,7.35,0,7.5,0,2.5,0,0,"Free Agent",6,null,null,"Neblett, Andre CAR DT"]
[957,957,"Nelson, David BUF WR",5.6,5.6,5.6,null,null,null,null,null,null,"B",null,null,null,null,null,null,null,null,null,"Free Agent (Q)",8,null,null,"Nelson, David BUF WR"]
[958,958,"Nelson, Jordy GBP WR",183.75,15.311999999999999,14.65,15.9,4.4000000000000004,25.3,5.4,42.35,29.2,null,0,"B",8.25,16.600000000000001,2.25,null,null,null,19.45,"Hurry Up and Happy Birthday, Donny (Q)",10,null,null,"Nelson, Jordy GBP WR"]
[959,959,"Nelson, Reggie CIN S",156.05000000000001,11.146000000000001,13.75,6,12.75,6.75,12.25,13.5,9.25,"B",8.5,null,null,11,14.25,20.3,4.5,14,9.25,"Free Agent",8,null,null,"Nelson, Reggie CIN S"]
[960,960,"Nevis, Drake IND DE",35.549999999999997,3.95,2.5,5,2.5,"B",5,3.75,0,11.8,2.5,2.5,null,null,null,null,null,null,null,"Free Agent",4,null,null,"Nevis, Drake IND DE"]
[961,961,"Newman, Terence CIN CB",136.5,9.1,3.75,15,8.5,6.25,11,11.25,4.5,"B",24.5,9.75,0,6.25,3,12.75,7,13,null,"Free Agent",8,null,null,{"$f":"IF(ISBLANK(C971),\"\",C971)","v":"Newman, Terence CIN CB"}]
[962,962,"Newsome, Jamar KCC WR",13.55,2.258,null,null,null,null,null,null,"B",null,null,null,null,2.25,1.65,3.75,1.85,4.05,0,"Free Agent",7,null,null,"Newsome, Jamar KCC WR"]
[963,963,"Newton, Cam CAR QB",308.89,19.306000000000001,12.55,25.82,5.28,28.2,2.84,"B",13.32,11.4,23.74,7.34,17.079999999999998,42.5,32.08,40.08,18.54,18.8,9.32,"Derek's Daycare ",6,null,null,"Newton, Cam CAR QB"]
[964,964,"Ngata, Haloti BAL DT",149.85,9.99,24.85,7.5,24.3,9.75,11,20.45,2.5,"B",0,0,15.75,6.25,1.25,8.75,1.25,16.25,null,"Invictus",8,null,null,"Ngata, Haloti BAL DT"]
[965,965,"Nicholas, Stephen ATL LB",162.80000000000001,10.175000000000001,29.3,14.5,8.25,10.5,5.25,0,"B",9.25,5.5,16.100000000000001,13.65,9.75,9.25,9.75,6.75,6,9,"Free Agent",7,null,null,"Nicholas, Stephen ATL LB"]
[966,966,"Nicks, Hakeem NYG WR",159.43,12.263999999999999,8.8000000000000007,44.38,null,null,null,8.15,11.55,9.6,2.25,18.75,"B",19.95,10.55,17.7,7.75,0,0,"Aaron Hernandez's Pistol Offense (P)",11,null,null,"Nicks, Hakeem NYG WR"]
[967,967,"Ninkovich, Rob NEP LB",198,12.375,0,11,3.75,23.75,20.100000000000001,10,19.7,11.8,"B",13.7,28.5,4.5,8.5,16.399999999999999,20.05,5,1.25,"Free Agent",9,null,null,"Ninkovich, Rob NEP LB"]
[968,968,"Noble, Danny TBB TE",0,0,0,0,0,0,"B",null,null,null,null,null,null,null,null,null,null,null,null,"Free Agent",5,null,null,"Noble, Danny TBB TE"]
[969,969,"Nolan, Troy CHI S",6.75,0.84399999999999997,0,0,0,null,0,"B",0,null,0,null,null,null,null,null,null,null,0,"Free Agent",6,null,null,"Nolan, Troy CHI S"]
[970,970,"Norman, Josh CAR CB",113.95,7.1219999999999999,5.25,9.75,16.75,14,4.5,"B",5.75,14.45,14.75,7.5,6,10.75,3,1.5,0,0,0,"Free Agent",6,null,null,"Norman, Josh CAR CB"]
[971,971,"Norwood, Jordan CLE WR",30.05,15.025,null,null,null,10.6,19.45,null,null,null,null,"B",null,null,null,null,null,null,null,"Free Agent (P)",10,null,null,"Norwood, Jordan CLE WR"]
[972,972,"Novak, Nick SDC PK",92,7.077,null,null,null,14,6,6,"B",6.5,7,6,3,7.5,7,11.5,1,10.5,6,"Free Agent",7,null,null,"Novak, Nick SDC PK"]
[973,973,"Nugent, Mike CIN PK",95.5,7.3460000000000001,7,10,8.5,9,6.5,6.5,5.5,"B",12,7,4,11.5,8,null,0,null,null,"Free Agent",8,null,null,"Nugent, Mike CIN PK"]
[974,974,"Nwagbuo, Ogemdi DET DE",0,0,null,null,null,null,"B",null,null,null,null,null,null,null,null,null,null,null,0,"Free Agent",5,null,null,"Nwagbuo, Ogemdi DET DE"]
[975,975,"O'Connell, Jake KCC TE",6.3,0.78700000000000003,0,0,null,0,0,0,"B",6.3,0,0,null,null,null,null,null,null,null,"Free Agent (P)",7,null,null,"O'Connell, Jake KCC TE"]
[976,976,"Obomanu, Ben SEA WR",11.9,1.488,0,0,2.0499999999999998,0,1.1000000000000001,0,8.75,0,null,null,"B",null,null,null,null,null,null,"Free Agent",11,null,null,"Obomanu, Ben SEA WR"]
[977,977,"Odrick, Jared MIA DE",119.65,7.4779999999999998,5,2.5,7.05,14.4,5.8,8.5,"B",2.5,9.25,3.5,5.5,17.2,2.5,15.85,11.6,2.5,6,"Free Agent",7,null,null,"Odrick, Jared MIA DE"]
[978,978,"Ogbonnaya, Chris CLE RB",42.7,2.847,null,10.3,5,2.8,8.4,3.1,5.3,2.2999999999999998,0,"B",0.1,0,0,0,0,2.2000000000000002,3.2,"Free Agent",10,null,null,"Ogbonnaya, Chris CLE RB"]
[979,979,"Ogletree, Kevin DAL WR",111.5,7.4329999999999998,34.4,4.3499999999999996,11.95,6.55,"B",0,7.7,0,20.350000000000001,0,2.25,null,3.05,5.3,2.15,2.4500000000000002,11,"Free Agent",5,null,null,"Ogletree, Kevin DAL WR"]
[980,980,"Ojomo, Adewale NYG DE",0,0,null,null,null,null,0,null,null,null,null,null,"B",null,null,null,null,null,null,"Free Agent",11,null,null,"Ojomo, Adewale NYG DE"]
[981,981,"Okoye, Amobi CHI DT",37.549999999999997,4.1719999999999997,null,5,15.8,0,0,"B",2.5,null,null,null,1.25,null,null,null,3.75,5.5,3.75,"Free Agent",6,null,null,"Okoye, Amobi CHI DT"]
[982,982,"Olawale, Jamize OAK RB",0,0,null,null,null,null,"B",null,null,null,null,null,null,null,null,null,0,0,0,"Free Agent",5,null,null,"Olawale, Jamize OAK RB"]
[983,983,"Olsen, Greg CAR TE",219.8,13.737,14.6,2.8,20.3,23.9,6.7,"B",9.1,6.8,12.3,35.700000000000003,7.2,11,14.2,17.5,13.1,14.3,10.3,"Polk High",6,null,null,"Olsen, Greg CAR TE"]
[984,984,"Onatolu, Kenny CAR LB",4.5,1.125,0,null,0,0,4.5,"B",null,null,null,null,null,null,null,null,null,null,null,"Free Agent",6,null,null,"Onatolu, Kenny CAR LB"]
[985,985,"Orakpo, Brian WAS LB",24.2,12.1,10.5,13.7,null,null,null,null,null,null,null,"B",null,null,null,null,null,null,null,"Free Agent (P)",10,null,null,"Orakpo, Brian WAS LB"]
[986,986,"Orlovsky, Dan TBB QB",2.04,2.04,null,null,null,null,"B",null,null,null,null,null,null,null,null,null,2.04,null,null,"Free Agent",5,null,null,"Orlovsky, Dan TBB QB"]
[987,987,"Orton, Kyle DAL QB",10.56,10.56,null,null,null,10.56,"B",null,null,null,null,null,null,null,null,null,null,null,null,"Free Agent",5,null,null,"Orton, Kyle DAL QB"]
[988,988,"Osgood, Kassim DET WR",0,0,0,0,0,0,"B",0,0,0,0,0,0,0,0,0,0,0,0,"Free Agent (Q)",5,null,null,"Osgood, Kassim DET WR"]
[989,989,"Osweiler, Brock DEN QB",-0.82,-0.16400000000000001,null,null,null,-0.1,null,null,"B",-0.1,null,null,null,null,null,null,-0.4,-0.1,-0.12,"Free Agent",7,null,null,"Osweiler, Brock DEN QB"]
[990,990,"Owens, Christopher ATL CB",35.75,2.75,0,3,null,null,0,0,"B",6.5,0,0,5.25,0,9.5,11.5,0,0,null,"Free Agent",7,null,null,"Owens, Christopher ATL CB"]
[991,991,"Owens, Montell JAC RB",49.2,3.7850000000000001,1.8,0,0,0,0,"B",0,null,null,0,0,0,7,17.2,6.3,16.899999999999999,null,"Free Agent",6,null,null,"Owens, Montell JAC RB"]
[992,992,"Owusu, Chris TBB WR",3.65,0.73,null,null,null,null,"B",null,null,null,null,0,null,0,0,0,3.65,null,null,"Free Agent (O)",5,null,null,"Owusu, Chris TBB WR"]
[993,993,"Pace, Calvin NYJ LB",99.1,6.194,7,4.5,6,13.25,4.5,2.25,6,12.15,"B",7.25,3,1.5,3.75,3,13.95,5.25,5.75,"Free Agent",9,null,null,"Pace, Calvin NYJ LB"]
[994,994,"Paea, Stephen CHI DT",65.650000000000006,4.3769999999999998,0,5,6,3.5,2.5,"B",5.5,6,7.35,3.75,4.25,5,10.050000000000001,null,5,0,1.75,"Free Agent",6,null,null,"Paea, Stephen CHI DT"]
[995,995,"Palmer, Ashlee DET LB",16.25,1.016,0,1.5,0,0,"B",0,0,4.75,4.5,0,0,0,0,4,1.5,0,0,"Free Agent",5,null,null,"Palmer, Ashlee DET LB"]
[996,996,"Palmer, Carson OAK QB",236.87,15.791,15.88,23.35,19.86,4.08,"B",14.65,17.32,16.260000000000002,37.14,20.100000000000001,17.8,0.84,24.85,15.82,7.68,1.24,null,"Aaron Hernandez's Pistol Offense",5,null,null,"Palmer, Carson OAK QB"]
[997,997,"Palmer, Michael ATL TE",17.2,1.323,2.1,0,1.6,null,null,null,"B",0,2,2,0,0,0,1.9,0,7.6,0,"Free Agent",7,null,null,"Palmer, Michael ATL TE"]
[998,998,"Palmer, Nathan IND WR",1.85,0.37,null,null,null,"B",0,0.85,0,null,null,0,1,null,null,null,null,null,null,"Free Agent",4,null,null,"Palmer, Nathan IND WR"]
[999,999,"Parker, Juqua CLE DE",104.3,6.5190000000000001,2.5,11.6,4.5,2.5,0,10.25,3,7.25,1.25,"B",13,5.5,9.1999999999999993,9.3000000000000007,16.45,2.5,5.5,"Free Agent",10,null,null,"Parker, Juqua CLE DE"]
[1000,1000,"Parker, Preston NOS WR",0.7,0.35,0,0.7,null,null,null,"B",null,null,null,null,null,null,null,null,null,null,null,"Free Agent",6,null,null,"Parker, Preston NOS WR"]
[1001,1001,"Parmele, Jalen JAC RB",36.619999999999997,3.3290000000000002,2.52,3.16,0,1.72,0,"B",0,2.9,5.22,3.6,11.3,6.2,null,null,null,null,null,"Free Agent",6,null,null,"Parmele, Jalen JAC RB"]
[1002,1002,"Parrish, Roscoe TBB WR",21.31,1.639,null,null,null,2.4,"B",1.4,1,-1.93,3.07,0.33,1,0,1,4.2,5.12,0.47,3.25,"Free Agent",5,null,null,"Parrish, Roscoe TBB WR"]
[1003,1003,"Pascoe, Bear NYG TE",15.5,1.0329999999999999,2.1,0,0,8.1,2.2000000000000002,0,0,0,null,0,"B",0,3.1,0,0,0,0,"Free Agent",11,null,null,"Pascoe, Bear NYG TE"]
[1004,1004,"Patrick, Johnny NOS CB",35.75,2.383,5.5,null,0,0,3.75,"B",0,0,1.5,6.75,3,0,0,0,1.5,6.25,7.5,"Free Agent (Q)",6,null,null,"Patrick, Johnny NOS CB"]
[1005,1005,"Patterson, Dimitri MIA CB",59.75,6.6390000000000002,4.5,11.5,1.5,21.5,9.5,null,"B",null,null,null,null,null,null,0.75,3,6,1.5,"Free Agent",7,null,null,"Patterson, Dimitri MIA CB"]
[1006,1006,"Patterson, Mike PHI DT",18.95,3.79,null,null,null,null,null,null,"B",null,1.25,0,6.25,10.199999999999999,1.25,null,null,null,null,"Free Agent",7,null,null,"Patterson, Mike PHI DT"]
[1007,1007,"Paul, Niles WAS TE",30.2,1.8879999999999999,0,5.8,0,4.5,0,0,0,5.2,3.7,"B",0,10.4,0,-3,0,3.6,0,"Free Agent",10,null,null,"Paul, Niles WAS TE"]
[1008,1008,"Paulsen, Logan WAS TE",74.3,4.6440000000000001,3.7,0,0,0,0,0,13.6,10.3,13.4,"B",9.1999999999999993,4.0999999999999996,2.6,2.2999999999999998,10.7,2.1,2.2999999999999998,"Free Agent",10,null,null,"Paulsen, Logan WAS TE"]
[1009,1009,"Paulson, David PIT TE",12.6,0.78700000000000003,0,0,0,"B",2.2999999999999998,2.2999999999999998,2.2000000000000002,0,2.2000000000000002,1.5,2.1,0,0,0,0,0,0,"Free Agent",4,null,null,"Paulson, David PIT TE"]
[1010,1010,"Paysinger, Spencer NYG LB",29,1.8120000000000001,0,0,7,0,3.75,1.5,0,1.5,0,3,"B",2.25,0,0,6.25,0.75,3,"Free Agent",11,null,null,"Paysinger, Spencer NYG LB"]
[1011,1011,"Pead, Isaiah STL RB",14.48,0.96499999999999997,1,0.48,2.36,null,0,1.3,1.38,4.76,"B",1.1000000000000001,0,0,0,0,0,0,2.1,"Roddy White Man Can't Jump (S)",9,null,null,"Pead, Isaiah STL RB"]
[1012,1012,"Peerman, Cedric CIN RB",52.78,3.77,2.2000000000000002,0.1,0,5.8,0,17.059999999999999,7.22,"B",0,5,7.5,6.1,0.4,null,null,0,1.4,"Free Agent",8,null,null,"Peerman, Cedric CIN RB"]
[1013,1013,"Peko, Domata CIN DT",121.15,7.5720000000000001,7.5,6,6.25,12.95,4.25,12.25,6.25,"B",7.5,8.3000000000000007,5,2.5,12.15,3.75,4.5,7.25,14.75,"Free Agent",8,null,null,"Peko, Domata CIN DT"]
[1014,1014,"Peppers, Julius CHI DE",184.95,11.558999999999999,9.5,18.100000000000001,10.55,3.75,2,"B",10.9,15.1,0,16.7,5,4.5,15.45,9.75,20.95,38.200000000000003,4.5,"Roddy White Man Can't Jump (P)",6,null,null,"Peppers, Julius CHI DE"]
[1015,1015,"Peprah, Charlie DAL S",26.2,5.24,null,null,null,null,"B",null,null,null,null,4,0.75,13.95,null,null,null,5.25,2.25,"Free Agent",5,null,null,"Peprah, Charlie DAL S"]
[1016,1016,"Perry, Nick GBP LB",40.450000000000003,6.742,10.5,0,13.15,3,13.8,0,null,null,null,"B",null,null,null,null,null,null,null,"Free Agent",10,null,null,"Perry, Nick GBP LB"]
[1017,1017,"Peters, Corey ATL DT",38,3.8,null,null,null,null,null,null,"B",0,0,3.75,0,5,2.5,5,0,14.25,7.5,"Free Agent",7,null,null,"Peters, Corey ATL DT"]
[1018,1018,"Peterson, Adrian MIN RB",389.68,24.355,21.7,11,11.7,16.2,13.3,19.899999999999999,26.96,17.7,38.94,33.020000000000003,"B",16.8,41.5,34.08,39.799999999999997,10,37.08,"Invictus",11,null,null,"Peterson, Adrian MIN RB"]
[1019,1019,"Peterson, Mike ATL LB",14.5,0.90600000000000003,0,0,0,0,0,1.5,"B",0,1.5,5.25,3.75,2.5,0,0,0,0,0,"Free Agent",7,null,null,"Peterson, Mike ATL LB"]
[1020,1020,"Peterson, Patrick ARI CB",196.06,12.254,9.77,13.2,4.97,13.7,21.07,22.4,2.72,5.5,9.02,"B",6.47,15.18,14.1,9.73,27.2,12.23,8.8000000000000007,"Aaron Hernandez's Pistol Offense",10,null,null,"Peterson, Patrick ARI CB"]
[1021,1021,"Pettigrew, Brandon DET TE",151.19999999999999,10.8,15.2,12.3,15.1,17.2,"B",8.3000000000000007,5.4,17.899999999999999,2.6,13.7,8.1999999999999993,16.399999999999999,14.8,0,null,null,4.0999999999999996,"Klingon Warriors",5,null,null,"Pettigrew, Brandon DET TE"]
[1022,1022,"Pettis, Austin STL WR",93.25,6.6609999999999996,null,null,0,4.7,1.85,2.35,10.199999999999999,5.25,"B",11.25,7.1,1.2,6.62,11.08,11.75,7.75,12.15,"Free Agent",9,null,null,"Pettis, Austin STL WR"]
[1023,1023,"Phillips, Jason CAR LB",17.5,1.0940000000000001,0,0,0,0,3,"B",0,0,0,0,0,0,3,0.75,3.75,3,4,"Free Agent (I)",6,null,null,"Phillips, Jason CAR LB"]
[1024,1024,"Phillips, John DAL TE",23.5,1.4690000000000001,2.1,4.5999999999999996,0,0,"B",3.4,0,11.9,0,0,0,0,1.5,0,0,0,0,"Free Agent",5,null,null,"Phillips, John DAL TE"]
[1025,1025,"Phillips, Kenny NYG S",39,5.5709999999999997,5.25,9.25,6.75,0,null,null,null,null,null,null,"B",7.5,0,null,null,null,10.25,"Free Agent",11,null,null,{"$f":"IF(ISBLANK(C1035),\"\",C1035)","v":"Phillips, Kenny NYG S"}]
[1026,1026,"Phillips, Shaun SDC LB",192.3,12.019,18.399999999999999,6.25,2.5,22,15.35,11,"B",15.6,10.5,12.5,20.45,14,1.25,1.25,10,29.5,1.75,"Free Agent",7,null,null,"Phillips, Shaun SDC LB"]
[1027,1027,"Pickett, Ryan GBP DE",103,6.4379999999999997,2.5,10.25,12.5,3,2.5,2.5,8.5,10,2.5,"B",5,5,5,11.25,8.75,2.5,11.25,"Free Agent",10,null,null,"Pickett, Ryan GBP DE"]
[1028,1028,"Pierce, Bernard BAL RB",72.900000000000006,4.556,1.9,0.4,3.7,4.8,1.3,3.7,0,"B",8.6,2.2999999999999998,2.9,3.4,4.9000000000000004,9.4,2,13.3,10.3,"Roddy White Man Can't Jump (P)",8,null,null,"Pierce, Bernard BAL RB"]
[1029,1029,"Pierre-Paul, Jason NYG DE",222.25,13.891,9.75,22.3,13.6,6,6.25,22.75,19.95,33.450000000000003,25.7,11,"B",7,5,13.75,5,8.5,12.25,"Aaron Hernandez's Pistol Offense (O)",11,null,null,"Pierre-Paul, Jason NYG DE"]
[1030,1030,"Pilares, Kealoha CAR WR",23.04,2.88,0.5,1.85,0,13.05,3.76,"B",1.92,0,1.96,null,null,null,null,null,null,null,null,"Free Agent",6,null,null,"Pilares, Kealoha CAR WR"]
[1031,1031,"Pitoitua, Ropati KCC DE",124.25,8.2829999999999995,2.5,5,2.5,28,null,3.75,"B",8.75,7.5,7.5,5,3.5,0,14.75,10,13,12.5,"Free Agent",7,null,null,"Pitoitua, Ropati KCC DE"]
[1032,1032,"Pitta, Dennis BAL TE",202.4,12.65,20.8,18.5,18.5,0,6.7,9.3000000000000007,10.8,"B",6.3,20.2,2,19.2,3.4,18.100000000000001,37,11.6,0,"Rancho Cucamonga Ghosts (O)",8,null,null,"Pitta, Dennis BAL TE"]
[1033,1033,"Poe, Dontari KCC DT",96,6,4.75,8.75,0,2.5,2.5,5,"B",10,2.5,1.25,6.25,12.75,2.5,8.75,11.25,11,6.25,"Free Agent",7,null,null,"Poe, Dontari KCC DT"]
[1034,1034,"Polamalu, Troy PIT S",66.45,9.4930000000000003,7.5,null,null,"B",3,null,null,null,null,null,null,null,3,8.25,10.5,20.350000000000001,13.85,"Free Agent",4,null,null,"Polamalu, Troy PIT S"]
[1035,1035,"Polk, Chris PHI RB",0,0,0,0,0,0,null,0,"B",0,0,null,null,null,null,null,null,null,null,"Free Agent",7,null,null,"Polk, Chris PHI RB"]
[1036,1036,"Pollard, Bernard BAL S",163.15,12.55,12.5,20.2,11.75,5.25,14.25,16.75,11.25,"B",6,21.7,8.5,11.25,15.5,8.25,null,null,null,"Derek's Daycare ",8,null,null,"Pollard, Bernard BAL S"]
[1037,1037,"Ponder, Christian MIN QB",169.72,10.606999999999999,5.9,13.5,27.22,2.94,17.420000000000002,17.899999999999999,-1.48,11.24,-2.1800000000000002,19.54,"B",3.96,6.56,-0.36,8.84,12.76,25.96,"Free Agent",11,null,null,"Ponder, Christian MIN QB"]
[1038,1038,"Pope, Leonard PIT TE",17.399999999999999,1.087,0,2.2000000000000002,0,"B",0,0,0,7.6,0,0,0,0,0,0,0,0,7.6,"Free Agent",4,null,null,"Pope, Leonard PIT TE"]
[1039,1039,"Poppinga, Brady DAL LB",12.25,3.0619999999999998,null,null,null,null,"B",null,null,null,null,null,null,null,null,0,1.5,7,3.75,"Free Agent",5,null,null,"Poppinga, Brady DAL LB"]
[1040,1040,"Porter, Tracy DEN CB",59.05,9.8420000000000005,40.799999999999997,6.25,3.75,1.5,6.75,null,"B",null,null,null,null,null,null,null,null,0,null,"Free Agent (Q)",7,null,null,"Porter, Tracy DEN CB"]
[1041,1041,"Posey, DeVier HOU WR",15.9,1.4450000000000001,null,null,null,0,-0.3,0,0,"B",null,0,0,null,0,3.15,8.35,1.85,2.85,"Free Agent (O)",8,null,null,"Posey, DeVier HOU WR"]
[1042,1042,"Posluszny, Paul JAC LB",238.25,14.891,10.75,13.5,20.3,14.25,12.75,"B",16.25,2.25,11.25,12,29.7,13.5,16.25,15.75,14.25,10.5,25,"Klingon Warriors",6,null,null,"Posluszny, Paul JAC LB"]
[1043,1043,"Potter, John FA PK",0,0,0,0,0,0,0,0,null,null,null,null,null,null,null,null,null,null,null,"Free Agent","-",null,null,"Potter, John FA PK"]
[1044,1044,"Potter, Zach JAC TE",3.6,0.22500000000000001,0,1.9,0,0,0,"B",0,0,0,0,0,0,0,1.7,0,0,0,"Free Agent",6,null,null,"Potter, Zach JAC TE"]
[1045,1045,"Pouha, Sione NYJ DT",69.95,5.8289999999999997,null,12.45,7.5,7.5,null,null,null,0,"B",10,5,2.5,5,6.25,5,7.5,1.25,"Free Agent",9,null,null,"Pouha, Sione NYJ DT"]
[1046,1046,"Powe, Jerrell KCC DT",15.25,1.694,5,2.5,1.75,2.5,0,0,"B",0,null,null,null,null,null,null,null,0,3.5,"Free Agent",7,null,null,"Powe, Jerrell KCC DT"]
[1047,1047,"Powell, Bilal NYJ RB",99.7,7.1210000000000004,3.6,3.3,8.9,1.1000000000000001,1.8,2.5,null,null,"B",2.1,20,13.3,5.8,13.8,6.3,7.4,9.8000000000000007,"Free Agent",9,null,null,"Powell, Bilal NYJ RB"]
[1048,1048,"Powell, William ARI RB",72.08,5.5449999999999999,null,null,null,5.4,5.7,10.76,2.3199999999999998,0,2.74,"B",6,16.12,3.36,7.78,0.4,5.7,5.8,"Free Agent",10,null,null,"Powell, William ARI RB"]
[1049,1049,"Powers, Jerraud IND CB",79.75,9.9689999999999994,14,17,5.5,"B",13.5,1.5,11.75,12.75,3.75,null,null,null,null,null,null,null,null,"Free Agent",4,null,null,"Powers, Jerraud IND CB"]
[1050,1050,"Prater, Matt DEN PK",135,8.4380000000000006,5,3,12.5,15,3,5,"B",10,7.5,10.5,12,2,7,14.5,9,10.5,8.5,"Free Agent",7,null,null,"Prater, Matt DEN PK"]
[1051,1051,"Pressley, Chris CIN RB",7.7,0.55000000000000004,0,0,0,7.1,0,0,0.28000000000000003,"B",0.32,0,0,0,0,0,0,null,null,"Free Agent",8,null,null,"Pressley, Chris CIN RB"]
[1052,1052,"Preston, Michael TEN WR",12.15,3.0369999999999999,null,null,null,null,null,null,null,null,null,null,"B",null,null,2.35,5.6,4.2,0,"Free Agent",11,null,null,"Preston, Michael TEN WR"]
[1053,1053,"Prosinski, Chris JAC S",82.1,5.1310000000000002,2.5,3,1.5,0.75,0,"B",4.5,7.75,6,4.7,9.25,7.5,3.75,0,5.25,19.899999999999999,5.75,"Free Agent",6,null,null,"Prosinski, Chris JAC S"]
[1054,1054,"Pryor, Terrelle OAK QB",27.5,9.1669999999999998,null,null,null,null,"B",null,null,null,null,null,null,null,null,null,0,3.6,23.9,"Free Agent",5,null,null,"Pryor, Terrelle OAK QB"]
[1055,1055,"Pugh, Jordan WAS S",28.4,2.1850000000000001,null,null,null,0,0,4.75,1.5,0.75,1.5,"B",0,0,4.5,8.4,0,4.5,2.5,"Free Agent",10,null,null,"Pugh, Jordan WAS S"]
[1056,1056,"Quick, Brian STL WR",41.35,2.9540000000000002,null,0,null,3.15,0,1.35,5.6,5.15,"B",10.85,2.15,0,1.55,1.85,9.6999999999999993,0,0,"BELAC",9,null,null,"Quick, Brian STL WR"]
[1057,1057,"Quin, Glover HOU S",178,11.125,11.25,1.5,9.5,15.05,9.25,16.25,20.75,"B",7.5,8.25,4.5,14.25,17.45,10.25,8.5,17.75,6,"Free Agent",8,null,null,"Quin, Glover HOU S"]
[1058,1058,"Quinn, Brady KCC QB",19.239999999999998,1.9239999999999999,null,null,null,null,1.28,2.2999999999999998,"B",-3.16,null,null,2.5,-0.06,18.239999999999998,-0.24,-1.56,1.58,-1.64,"Free Agent",7,null,null,"Quinn, Brady KCC QB"]
[1059,1059,"Quinn, Robert STL DE",145.35,9.0839999999999996,14.4,14.4,0,14.3,38.4,0,11.4,3.75,"B",17.850000000000001,2.5,0,0,12.4,3.5,3.75,8.6999999999999993,"Hurry Up and Happy Birthday, Donny",9,null,null,"Quinn, Robert STL DE"]
[1060,1060,"Rainey, Chris FA RB",79.67,4.9790000000000001,1.4,4.47,6.76,null,3.88,6.55,14.38,4.82,8.02,0.65,1.44,12.2,2.44,5.12,2.82,2.68,2.04,"Free Agent","-",null,null,"Rainey, Chris FA RB"]
[1061,1061,"Raji, B.J. GBP DT",60,4.2859999999999996,1.25,6.25,5,1.25,0,null,null,3.75,0,"B",1.25,7.5,4.25,10,2.5,5,12,"Free Agent",10,null,null,"Raji, B.J. GBP DT"]
[1062,1062,"Randall, Kheeston MIA DT",17.5,1.458,5,0,0,2.5,0,3.75,"B",1.25,2.5,2.5,0,0,null,0,null,null,null,"Free Agent",7,null,null,"Randall, Kheeston MIA DT"]
[1063,1063,"Randle, Rueben NYG WR",78.739999999999995,4.9210000000000003,0,1.53,2.0499999999999998,1.93,16.23,0.13,0,10.37,0,4.7699999999999996,"B",9.1,3.28,0,0,6.55,22.8,"Invictus",11,null,null,"Randle, Rueben NYG WR"]
[1064,1064,"Ratliff, Jay DAL DT",35,5.8330000000000002,null,null,null,null,"B",7.5,5,10,0,3.75,8.75,null,null,null,null,null,null,"Free Agent (Q)",5,null,null,"Ratliff, Jay DAL DT"]
[1065,1065,"Raymond, Mistral MIN S",24.25,2.4249999999999998,7,3,0,null,null,null,null,null,null,0.75,"B",1.5,3,1.5,0,1.5,6,"Free Agent",11,null,null,"Raymond, Mistral MIN S"]
[1066,1066,"Redding, Cory IND DE",101.2,7.2290000000000001,5,16.25,1.25,"B",23.2,2.5,null,5,2.5,7.5,7.25,2.5,8.5,6.25,11,2.5,null,"Free Agent",4,null,null,"Redding, Cory IND DE"]
[1067,1067,"Redman, Isaac PIT RB",91.34,6.524,4.7,10.9,8.1,"B",4.0999999999999996,16.899999999999999,null,null,26.04,2.9,0.5,0.2,4.3,0,5.4,2.6,4.7,"Free Agent",4,null,null,"Redman, Isaac PIT RB"]
[1068,1068,"Reece, Marcel OAK RB",132.84,8.3030000000000008,0.7,3.7,8.14,10.4,"B",1.1000000000000001,9.8000000000000007,0,22.5,17.399999999999999,24.3,14.3,10.6,2.5,1.6,5.8,0,"Free Agent",5,null,null,"Reece, Marcel OAK RB"]
[1069,1069,"Reed, Brooks HOU LB",64.099999999999994,5.3419999999999996,2.25,8.4,7.2,6.25,14.5,4.5,4.5,"B",3,2.25,3.25,0,null,null,null,8,null,"Free Agent",8,null,null,"Reed, Brooks HOU LB"]
[1070,1070,"Reed, David BAL WR",12.85,2.57,null,null,null,null,null,null,null,"B",null,null,null,null,0,0,4.7,0,8.15,"Free Agent",8,null,null,"Reed, David BAL WR"]
[1071,1071,"Reed, Edward BAL S",159.12,9.9450000000000003,22.4,15.9,14.5,9.75,7,4.5,8.32,"B",19.350000000000001,4.5,5.5,3,14.9,7.5,10.75,11.25,0,"Free Agent (O)",8,null,null,"Reed, Edward BAL S"]
[1072,1072,"Reeves, Jacques KCC CB",6,3,6,0,null,null,null,null,"B",null,null,null,null,null,null,null,null,null,null,"Free Agent",7,null,null,"Reeves, Jacques KCC CB"]
[1073,1073,"Reuland, Konrad NYJ TE",24.8,1.55,0,5,4.2,0,0,0,2.6,0,"B",0,3.3,2.2000000000000002,0,3.7,1.9,0,1.9,"Free Agent",9,null,null,"Reuland, Konrad NYJ TE"]
[1074,1074,"Revis, Darrelle NYJ CB",33.85,16.925000000000001,19.350000000000001,null,14.5,null,null,null,null,null,"B",null,null,null,null,null,null,null,null,"Invictus (P)",9,null,null,"Revis, Darrelle NYJ CB"]
[1075,1075,"Rey, Vincent CIN LB",25.05,1.5660000000000001,0,12.8,8.5,1.5,0,0.75,0,"B",0,0,1.5,0,0,0,0,0,0,"Free Agent",8,null,null,"Rey, Vincent CIN LB"]
[1076,1076,"Reyes, Kendall SDC DE",97.3,6.0810000000000004,0,2.5,1.25,2.5,2.5,1.25,"B",1.25,1.25,2.5,21,5.5,6.25,5,8,32.799999999999997,3.75,"Free Agent",7,null,null,"Reyes, Kendall SDC DE"]
[1077,1077,"Reynaud, Darius TEN RB",105.73,6.6079999999999997,8.82,3.88,13.49,3.16,4.91,5.84,8.0399999999999991,1.95,5.8,5.99,"B",4.0199999999999996,6.57,1.1299999999999999,3.2,4.5999999999999996,24.33,"Free Agent",11,null,null,"Reynaud, Darius TEN RB"]
[1078,1078,"Rhodes, Kerry ARI S",157.75,10.516999999999999,4.5,7.75,18.100000000000001,18,3,8.5,null,5.25,7.5,"B",13.7,9.75,32.700000000000003,6.25,7,7.5,8.25,"Free Agent",10,null,null,"Rhodes, Kerry ARI S"]
[1079,1079,"Rice, Ray BAL RB",285.10000000000002,17.818999999999999,24.3,22.2,26,17.600000000000001,12.8,24.6,10.4,"B",18.399999999999999,16.8,13.3,24.4,15.3,23.6,7.1,27.8,0.5,"BELAC",8,null,null,"Rice, Ray BAL RB"]
[1080,1080,"Rice, Sidney SEA WR",182.9,11.430999999999999,14.6,7.05,3.45,9.1,12.95,18.850000000000001,5.7,19.3,17.399999999999999,19.899999999999999,"B",8.9499999999999993,23.4,6,13.6,2.65,0,"Polk High (P)",11,null,null,"Rice, Sidney SEA WR"]
[1081,1081,"Richardson, Daryl STL RB",84.8,5.3,2,12.2,3,4.9000000000000004,3.5,12.9,10.9,8,"B",6.8,2.4,3.2,4.3,0.4,6,0.9,3.4,"I like my Women like I like my coffee, _______.",9,null,null,"Richardson, Daryl STL RB"]
[1082,1082,"Richardson, Sean GBP S",0.75,0.15,null,null,null,null,null,null,0,0,0,"B",0.75,0,null,null,null,null,null,"Free Agent (O)",10,null,null,"Richardson, Sean GBP S"]
[1083,1083,"Richardson, Trent CLE RB",254.7,16.98,6.4,30.5,17.100000000000001,20.399999999999999,23.8,7.4,3.9,20.399999999999999,18.600000000000001,"B",20.399999999999999,21.2,18.5,18.100000000000001,18.2,9.8000000000000007,null,"The Black Champion",10,null,null,"Richardson, Trent CLE RB"]
[1084,1084,"Ridley, Stevan NEP RB",205.42,12.839,23.2,12.5,3.7,21.6,21.12,4.4000000000000004,6.5,19.7,"B",15.8,8.8000000000000007,15.7,13.1,12.2,-0.7,8.4,19.399999999999999,"Angry Neighbors",9,null,null,"Ridley, Stevan NEP RB"]
[1085,1085,"Riley, Perry WAS LB",193.05,12.066000000000001,6.75,13,19.899999999999999,1.5,15.5,16.75,14.75,9.75,6.75,"B",17.8,14.55,7.5,15.75,5.25,18.8,8.75,"Polk High",10,null,null,"Riley, Perry WAS LB"]
[1086,1086,"Ringer, Javon TEN RB",5.6,2.8,null,null,null,1.4,4.2,null,null,null,null,null,"B",null,null,null,null,null,null,"Free Agent",11,null,null,"Ringer, Javon TEN RB"]
[1087,1087,"Rivers, Keith NYG LB",57.25,5.2050000000000001,10,null,0,null,null,1.5,10,9,null,null,"B",0,5.5,4.5,2.25,7,7.5,"Free Agent",11,null,null,"Rivers, Keith NYG LB"]
[1088,1088,"Rivers, Philip SDC QB",166.35,10.397,14.04,18.260000000000002,0.12,10.56,17.7,-2.36,"B",5.16,14.6,25.35,6.32,8.1199999999999992,2.2000000000000002,22.3,-2.76,13,13.74,"Free Agent",7,null,null,"Rivers, Philip SDC QB"]
[1089,1089,"Roach, Nick CHI LB",116.35,7.2720000000000002,3.5,3.75,9.9,2.5,4,"B",0,3,4.5,3,9.4499999999999993,12.75,7.5,12.5,13.25,13,13.75,"Rancho Cucamonga Ghosts",6,null,null,{"$f":"IF(ISBLANK(C1099),\"\",C1099)","v":"Roach, Nick CHI LB"}]
[1090,1090,"Roberts, Andre ARI WR",188.8,12.587,19.149999999999999,7.45,9.25,32.299999999999997,10.45,4.3,25.05,15.25,11.6,"B",2.62,21.75,null,7.35,5.95,10.65,5.68,"Angry Neighbors",10,null,null,"Roberts, Andre ARI WR"]
[1091,1091,"Robertson, Craig CLE LB",136.35,8.5220000000000002,19.850000000000001,4.5,11.25,11.25,7.5,7.5,8.25,0.75,1.5,"B",16.25,5.5,4.5,4.5,7.25,20.5,5.5,"Free Agent",10,null,null,"Robertson, Craig CLE LB"]
[1092,1092,"Robinson, Adrian PIT LB",0,0,null,null,0,"B",null,null,0,0,0,0,null,0,0,0,0,null,0,"Free Agent",4,null,null,"Robinson, Adrian PIT LB"]
[1093,1093,"Robinson, Adrien NYG TE",0,0,0,null,null,null,0,null,null,null,null,null,"B",null,null,null,null,null,null,"Free Agent",11,null,null,"Robinson, Adrien NYG TE"]
[1094,1094,"Robinson, Aldrick WAS WR",58.85,3.923,16.2,6.5,2.4500000000000002,null,2.25,0,1.4,0,1.85,"B",13.15,15.05,0,0,0,0,0,"Free Agent",10,null,null,"Robinson, Aldrick WAS WR"]
[1095,1095,"Robinson, Dunta ATL CB",153.15,9.5719999999999992,3.75,9.5,9,11.5,21.45,13.75,"B",3,6,12.75,4,16.7,9,13,3,16.75,0,"Free Agent (P)",7,null,null,"Robinson, Dunta ATL CB"]
[1096,1096,"Robinson, Josh MIN CB",102.49,6.4059999999999997,6,3,13.65,13,9,4.5,4.5,2.25,3,5.25,"B",3.56,4.5,19.399999999999999,9,0,1.88,"Free Agent",11,null,null,"Robinson, Josh MIN CB"]
[1097,1097,"Robinson, Keenan WAS LB",7.5,0.68200000000000005,0,0,0,0,0,0,1.5,2.25,0,"B",0.75,3,null,null,null,null,null,"Free Agent (O)",10,null,null,"Robinson, Keenan WAS LB"]
[1098,1098,"Robinson, Laurent JAC WR",52.2,7.4569999999999999,12.85,8.65,0,3.15,null,"B",null,null,11.6,15.95,0,null,null,null,null,null,null,"Free Agent",6,null,null,"Robinson, Laurent JAC WR"]
[1099,1099,"Robinson, Michael SEA RB",42.5,2.6560000000000001,0,0.6,0,0,1.3,0,2.4,1.8,4.4000000000000004,0,"B",7.4,4.0999999999999996,2.2000000000000002,5.9,0.1,12.3,"Free Agent",11,null,null,"Robinson, Michael SEA RB"]
[1100,1100,"Robinson, Patrick NOS CB",172.55,10.784000000000001,13.9,8.75,17.25,15.5,9.75,"B",12,11.5,24.9,3.75,5,12.25,3.75,13,4.5,11.25,5.5,"Free Agent (Q)",6,null,null,"Robinson, Patrick NOS CB"]
[1101,1101,"Robinson, Trent SFO S",0,0,0,0,0,null,null,null,null,null,"B",null,null,null,null,null,null,null,null,"Free Agent",9,null,null,"Robinson, Trent SFO S"]
[1102,1102,"Robiskie, Brian DET WR",15.4,2.5670000000000002,null,null,null,null,"B",null,null,0,null,null,null,0,null,0,2.15,1.75,11.5,"Free Agent",5,null,null,"Robiskie, Brian DET WR"]
[1103,1103,"Robison, Brian MIN DE",159.19999999999999,10.613,11,5,3.25,6.25,13.05,3.75,41.55,12.5,14.3,5,"B",3.75,3.75,15.25,9.3000000000000007,null,11.5,"Free Agent",11,null,null,"Robison, Brian MIN DE"]
[1104,1104,"Roby, Courtney NOS WR",2.15,0.16500000000000001,0,2.15,0,0,0,"B",0,0,null,null,0,0,null,0,0,0,0,"Free Agent",6,null,null,"Roby, Courtney NOS WR"]
[1105,1105,"Rodgers, Aaron GBP QB",349.69,21.856000000000002,24.85,5.16,2.62,34.25,22.1,48.6,30.1,12.84,30.02,"B",13.74,5.96,12.94,10.119999999999999,25.94,38.200000000000003,32.25,"Polk High",10,null,null,"Rodgers, Aaron GBP QB"]
[1106,1106,"Rodgers, Jacquizz ATL RB",166.08,10.38,9.66,1.22,17.7,10.88,3.64,6.06,"B",15.2,11.1,10.199999999999999,12.22,18.82,6.78,14.08,4.9000000000000004,5.46,18.16,"I like my Women like I like my coffee, _______.",7,null,null,"Rodgers, Jacquizz ATL RB"]
[1107,1107,"Rodgers-Cromartie, Dominique PHI CB",129.4,8.0879999999999992,21.5,1.5,9.5,15.65,4.5,4.75,"B",6.25,4.5,1.5,7,17.75,7,12,5.5,2.25,8.25,"Free Agent (P)",7,null,null,"Rodgers-Cromartie, Dominique PHI CB"]
[1108,1108,"Rodriguez, Evan CHI TE",8.1,0.67500000000000004,0,0,0,null,null,"B",null,null,0,0,0,2.6,3.8,0,0,0,1.7,"Free Agent",6,null,null,"Rodriguez, Evan CHI TE"]
[1109,1109,"Roethlisberger, Ben PIT QB",224.86,17.297000000000001,12.2,18,39,"B",15.2,22.55,9.02,24.48,9.5399999999999991,8.76,null,null,null,22.7,21.15,4.0999999999999996,18.16,"Invictus (P)",4,null,null,"Roethlisberger, Ben PIT QB"]
[1110,1110,"Rogers, Carlos SFO CB",128,8,12.7,5.5,4,14.75,3.75,12,5.25,9,"B",9,4.5,0,10.5,3,18.05,10.5,5.5,"Free Agent",9,null,null,"Rogers, Carlos SFO CB"]
[1111,1111,"Rogers, Justin BUF CB",72.28,4.5170000000000003,0,0.75,8.5,6.75,1.5,3,4.5,"B",2.5,7.5,7,11.65,4,3,5.12,5.43,1.08,"Free Agent (Q)",8,null,null,"Rogers, Justin BUF CB"]
[1112,1112,"Rolle, Antrel NYG S",156.44999999999999,9.7780000000000005,13.5,7,10.5,3,8.75,29.2,4.5,3,13.75,6,"B",7.5,11.25,16.75,0.75,13.5,7.5,"Free Agent (P)",11,null,null,"Rolle, Antrel NYG S"]
[1113,1113,"Rolle, Brian PIT LB",3,0.75,0,0,3,"B",null,null,null,null,null,null,null,null,null,null,null,null,null,"Free Agent",4,null,null,"Rolle, Brian PIT LB"]
[1114,1114,"Romo, Tony DAL QB",301.22000000000003,18.826000000000001,27.55,10.64,0.32,2.95,"B",16.440000000000001,15.18,23.22,21.05,16.260000000000002,11.65,37.159999999999997,27.75,9.7200000000000006,25.65,45.96,9.7200000000000006,"Aaron Hernandez's Pistol Offense",5,null,null,"Romo, Tony DAL QB"]
[1115,1115,"Rosario, Dante SDC TE",39.5,3.0379999999999998,0,28.8,-1.5,0,3.1,0,"B",4.0999999999999996,0,2.6,null,null,null,0,2.4,0,0,"Free Agent",7,null,null,"Rosario, Dante SDC TE"]
[1116,1116,"Ross, Aaron JAC CB",70.81,5.4470000000000001,7.5,7.5,7,2.25,3,"B",5.5,3.75,10.08,8.5,5.98,4.5,3.75,null,null,null,1.5,"Free Agent",6,null,null,"Ross, Aaron JAC CB"]
[1117,1117,"Ross, Jeremy GBP WR",10.3,2.06,null,null,null,null,null,null,null,null,null,"B",null,null,0,0,0,4.13,6.17,"Free Agent",10,null,null,"Ross, Jeremy GBP WR"]
[1118,1118,"Routt, Stanford HOU CB",57.9,6.4329999999999998,6,5.5,17.45,3,4.5,4.5,null,"B",null,null,null,null,null,0,0,null,null,"Free Agent",8,null,null,"Routt, Stanford HOU CB"]
[1119,1119,"Royal, Eddie SDC WR",61.62,6.1619999999999999,5.3,4.37,4.4000000000000004,8.35,6.67,5.63,"B",null,null,8.08,7.0000000000000007E-2,null,null,null,null,7.65,11.1,"Free Agent",7,null,null,"Royal, Eddie SDC WR"]
[1120,1120,"Royster, Evan WAS RB",48.26,3.016,1,3.1,5.4,4.9000000000000004,1.7,1.7,1,0,12.6,"B",0.3,0,0.3,1.1000000000000001,12.18,1.4,1.58,"Free Agent",10,null,null,"Royster, Evan WAS RB"]
[1121,1121,"Rubin, Ahtyba CLE DT",118.8,9.1379999999999999,14.25,3.75,8.75,21.4,8.75,null,1.25,null,null,"B",20.65,8,5,4.75,1.25,7.25,13.75,"Free Agent",10,null,null,"Rubin, Ahtyba CLE DT"]
[1122,1122,"Rucker, Frostee CLE DE",128.94999999999999,8.0589999999999993,5,14.5,7.5,5,2.5,3.75,12.45,0,12.5,"B",17.2,6.25,8.5,20.05,1.25,7.5,5,"Free Agent (Q)",10,null,null,"Rucker, Frostee CLE DE"]
[1123,1123,"Rudolph, Kyle MIN TE",184.8,11.55,14.2,14,23.1,3.8,14.3,22.6,0,4.7,0,22.9,"B",19,20.100000000000001,0,6.7,14.4,5,"Angry Neighbors",11,null,null,"Rudolph, Kyle MIN TE"]
[1124,1124,"Rutland, Kevin JAC CB",9.75,0.75,3,0,0,null,null,"B",null,0,0,0,0,0,6.75,0,0,0,0,"Free Agent",6,null,null,"Rutland, Kevin JAC CB"]
[1125,1125,"Ruud, Barrett HOU LB",26.8,2.2330000000000001,null,null,0,0,0,null,null,"B",0,0,0,5,11.3,4.5,0,0.75,5.25,"Free Agent",8,null,null,"Ruud, Barrett HOU LB"]
[1126,1126,"Ryan, Matt ATL QB",330.1,20.631,34.46,19.66,21.4,26.45,20.45,6.46,"B",26.28,14.9,37.86,-1.25,17.95,10.4,22.1,25.7,33.659999999999997,13.62,"Hurry Up and Happy Birthday, Donny",7,null,null,"Ryan, Matt ATL QB"]
[1127,1127,"Ryans, DeMeco PHI LB",181.55,11.347,8.5,25.55,10,5.5,13.5,19.25,"B",14,7.25,13.25,9.5,15.25,6.25,9.75,13.75,5.5,4.75,"Aaron Hernandez's Pistol Offense",7,null,null,"Ryans, DeMeco PHI LB"]
[1128,1128,"Saine, Brandon GBP RB",0,0,0,0,0,0,0,0,null,null,null,"B",null,null,null,null,null,null,null,"Free Agent",10,null,null,"Saine, Brandon GBP RB"]
[1129,1129,"Salas, Greg PHI WR",0,0,null,null,null,null,null,null,"B",null,null,null,0,null,null,null,null,null,null,"Free Agent",7,null,null,"Salas, Greg PHI WR"]
[1130,1130,"Samuel, Asante ATL CB",139.5,9.3000000000000007,7,9.75,9,3,1.5,27.4,"B",5,7,16.8,7.5,5,0,null,11.35,15.1,14.1,"Free Agent",7,null,null,"Samuel, Asante ATL CB"]
[1131,1131,"Sanchez, Mark NYJ QB",80.27,5.351,22.64,9.52,14.7,-4.88,3.3,12.18,9.1999999999999993,6.92,"B",-3.04,8.92,12.25,-7.92,1.54,-6.86,null,1.8,"Free Agent",9,null,null,"Sanchez, Mark NYJ QB"]
[1132,1132,"Sanders, Emmanuel PIT WR",122.28,7.6420000000000003,11.58,7.05,7.05,"B",5.95,9.3000000000000007,6.5,9.35,15.57,5.9,12.75,8.08,9.25,6.1,0,2.5499999999999998,5.3,"Aaron Hernandez's Pistol Offense",4,null,null,"Sanders, Emmanuel PIT WR"]
[1133,1133,"Sanders, James ARI S",19.75,1.3169999999999999,0,0,10,0,0,0,6.75,0,0,"B",0,0,0,1.5,null,0,1.5,"Free Agent",10,null,null,"Sanders, James ARI S"]
[1134,1134,"Sanford, Jamarca MIN S",104,6.5,0,3,6.75,20.5,8,12,7.5,12.5,7.5,6,"B",5.25,2.25,3.75,4.5,0,4.5,"Free Agent",11,null,null,"Sanford, Jamarca MIN S"]
[1135,1135,"Sanu, Mohamed CIN WR",68.900000000000006,8.6129999999999995,null,null,8,0,0,null,7.15,"B",5.4,16,10.7,21.65,null,null,null,null,null,"Aaron Hernandez's Pistol Offense",8,null,null,"Sanu, Mohamed CIN WR"]
[1136,1136,"Sanzenbacher, Dane CIN WR",1.95,0.48699999999999999,null,null,null,0,1.95,null,0,"B",null,null,null,null,0,null,null,null,null,"Free Agent",8,null,null,"Sanzenbacher, Dane CIN WR"]
[1137,1137,"Sapp, Ricky NYJ LB",0,0,null,null,null,null,null,null,null,null,"B",0,0,0,null,null,null,null,0,"Free Agent",9,null,null,"Sapp, Ricky NYJ LB"]
[1138,1138,"Sash, Tyler NYG S",6,0.85699999999999998,null,null,null,null,null,0,0,4.5,0,0,"B",0.75,0.75,null,null,null,null,"Free Agent",11,null,null,"Sash, Tyler NYG S"]
[1139,1139,"Saunders, Weslye IND TE",4.5,0.40899999999999997,null,null,null,"B",null,null,0,2.6,0,0,0,1.9,0,0,0,0,0,"Free Agent",4,null,null,"Saunders, Weslye IND TE"]
[1140,1140,"Scandrick, Orlando DAL CB",40.25,3.6589999999999998,5.5,1.5,2.25,2.5,"B",3,3,2.5,3,12.5,3.75,0.75,null,null,null,null,null,"Free Agent",5,null,null,"Scandrick, Orlando DAL CB"]
[1141,1141,"Schaefering, Brian DAL DT",5,1.667,null,null,null,null,"B",null,null,null,null,null,null,null,null,null,1.25,3.75,0,"Free Agent",5,null,null,"Schaefering, Brian DAL DT"]
[1142,1142,"Schaub, Matt HOU QB",226.31,14.144,13.44,7.5,30.6,17.88,10.36,0.08,18.04,"B",18.62,1.6,50.62,15.65,20.18,3.28,13.44,4.12,0.9,"Rancho Cucamonga Ghosts",8,null,null,"Schaub, Matt HOU QB"]
[1143,1143,"Scheffler, Tony DET TE",121.4,8.093,10.5,2.8,null,3.1,"B",14.6,2.1,10.6,5.8,0,5.2,13.2,10,12.5,8.1,10.1,12.8,"Free Agent",5,null,null,"Scheffler, Tony DET TE"]
[1144,1144,"Schilens, Chaz NYJ WR",73.900000000000006,4.9269999999999996,2.0499999999999998,0,4.0999999999999996,8.25,7.9,4.8,0,13.9,"B",0,15.8,3.3,3,5.2,0,5.6,null,"Free Agent",9,null,null,"Schilens, Chaz NYJ WR"]
[1145,1145,"Schmitt, Owen FA RB",0.1,8.0000000000000002E-3,0,0,0,0,null,0,0.2,0,0,0,0,-0.1,0,0,null,null,null,"Free Agent","-",null,null,"Schmitt, Owen FA RB"]
[1146,1146,"Schofield, O'Brien ARI LB",74.7,8.3000000000000007,6,0,14.6,13.4,9.5,22.95,0,2.25,6,"B",null,null,null,null,null,null,null,"Free Agent (P)",10,null,null,"Schofield, O'Brien ARI LB"]
[1147,1147,"Scobee, Josh JAC PK",97,6.0620000000000003,8.5,1,11,4,3,"B",13.5,9,0,3.5,14,6.5,4,4,3,10,2,"Free Agent",6,null,null,"Scobee, Josh JAC PK"]
[1148,1148,"Scott, Bart NYJ LB",106.9,7.1269999999999998,7,8.75,9.25,6.75,4,2.25,2.5,null,"B",13.95,3.25,3.75,7.9,9.35,6.25,13.7,8.25,"Free Agent",9,null,null,"Scott, Bart NYJ LB"]
[1149,1149,"Scott, Bernard CIN RB",3.5,1.75,null,null,-0.5,null,4,null,null,"B",null,null,null,null,null,null,null,null,null,"Free Agent (O)",8,null,null,"Scott, Bernard CIN RB"]
[1150,1150,"Scott, Bryan BUF LB",141.85,8.8659999999999997,13.5,3.25,12.2,19,4.5,6.75,10.5,"B",3.75,3.75,12.65,10.75,3,7,4.5,6.75,20,"Free Agent",8,null,null,"Scott, Bryan BUF LB"]
[1151,1151,"Scott, Da'Rel NYG RB",0.9,0.22500000000000001,null,null,0.9,0,0,0,null,null,null,null,"B",null,null,null,null,null,null,"Free Agent",11,null,null,"Scott, Da'Rel NYG RB"]
[1152,1152,"Scott, Trevor NEP DE",42.2,3.0139999999999998,0,0,2.5,0,1.25,1.25,0,null,"B",null,1.75,1.25,22.7,2.5,0,0,9,"Free Agent",9,null,null,"Scott, Trevor NEP DE"]
[1153,1153,"Scruggs, Greg SEA DE",28.55,2.5950000000000002,null,0,0,null,null,1.25,8.5,2.5,8.8000000000000007,null,"B",null,0,0,5,0,2.5,"Free Agent (O)",11,null,null,{"$f":"IF(ISBLANK(C1163),\"\",C1163)","v":"Scruggs, Greg SEA DE"}]
[1154,1154,"Searcy, Da'Norris BUF S",54.75,3.65,2.25,3.75,0,5.25,4.5,0,0,"B",4.5,5.5,5.25,4.25,7.75,6.25,3,2.5,null,"Free Agent",8,null,null,"Searcy, Da'Norris BUF S"]
[1155,1155,"Selvie, George JAC DE",40.25,4.4720000000000004,null,null,null,null,null,"B",1.25,6,8.5,5,2.5,2.5,4.25,null,null,2.5,7.75,"Free Agent",6,null,null,"Selvie, George JAC DE"]
[1156,1156,"Senn, Jordan CAR LB",2.5,0.156,0,0,0,0,0,"B",0,0,0,0,0,0,0,0,0,2.5,0,"Free Agent",6,null,null,"Senn, Jordan CAR LB"]
[1157,1157,"Sensabaugh, Coty TEN CB",41.25,2.5779999999999998,0,2.25,3,0,0,0,0,1.5,4.5,8.75,"B",4.5,0,6.25,2.25,3.75,4.5,"Free Agent",11,null,null,"Sensabaugh, Coty TEN CB"]
[1158,1158,"Sensabaugh, Gerald DAL S",80.75,5.383,3,3,null,6.75,"B",3,3.75,4,9,4.5,9,3.75,6,4,6.75,9.25,5,"Free Agent",5,null,null,"Sensabaugh, Gerald DAL S"]
[1159,1159,"Seymour, Richard OAK DT",60.05,7.5060000000000002,6.75,2.5,11.5,6.25,"B",3.5,16.25,11.3,2,null,null,null,null,null,null,null,null,"Free Agent",5,null,null,"Seymour, Richard OAK DT"]
[1160,1160,"Shanle, Scott NOS LB",28.95,4.1360000000000001,6.2,1.5,4.5,6.25,6.75,"B",2.25,null,1.5,null,null,null,null,null,null,null,null,"Free Agent",6,null,null,"Shanle, Scott NOS LB"]
[1161,1161,"Sharpton, Darryl HOU LB",44.8,6.4,null,null,null,null,null,null,null,"B",null,null,9.25,10,11.8,4.5,3,3,3.25,"Free Agent",8,null,null,"Sharpton, Darryl HOU LB"]
[1162,1162,"Shaughnessy, Matt OAK DE",71.900000000000006,4.4939999999999998,8.4499999999999993,14.1,0,9.25,"B",15.55,1.25,4,1.25,3,2.25,8.3000000000000007,0,1.5,0,0,3,"Free Agent",5,null,null,"Shaughnessy, Matt OAK DE"]
[1163,1163,"Shaw, Tim TEN LB",50,3.125,0,1.5,0,0,0,2,5.25,0,4.5,3,"B",0,9,4.5,11.25,5.25,3.75,"Free Agent",11,null,null,"Shaw, Tim TEN LB"]
[1164,1164,"Sheard, Jabaal CLE DE",126.75,7.9219999999999997,4,5.5,4.75,15.4,4.5,4.75,3,1.5,15.8,"B",9.6999999999999993,3,1.5,10.65,14.4,9,19.3,"Free Agent",10,null,null,"Sheard, Jabaal CLE DE"]
[1165,1165,"Sheffield, Cameron DAL LB",0,0,0,null,null,null,"B",null,null,null,null,null,null,null,null,null,null,null,null,"Free Agent",5,null,null,"Sheffield, Cameron DAL LB"]
[1166,1166,"Sheppard, Kelvin BUF LB",114.7,7.1689999999999996,9.75,13,3,1.25,3,12,9.5,"B",6,0,6.75,2.25,4.5,7.75,16.45,9,10.5,"Free Agent",8,null,null,"Sheppard, Kelvin BUF LB"]
[1167,1167,"Sherels, Marcus MIN CB",51.27,3.2040000000000002,1.47,5.07,0,11.13,-7.0000000000000007E-2,-0.13,0,3.57,1.03,3.68,"B",1.52,2.19,0,5.96,5.49,10.36,"Free Agent",11,null,null,"Sherels, Marcus MIN CB"]
[1168,1168,"Sherman, Anthony ARI RB",11,0.78600000000000003,0,0,0,2.1,4.5,0,null,3.1,1.3,"B",0,0,0,0,0,0,null,"Free Agent",10,null,null,"Sherman, Anthony ARI RB"]
[1169,1169,"Sherman, Richard SEA CB",213.3,13.331,16,8.5,7,17.399999999999999,13,17,7,10.5,1.5,26.85,"B",7,10,30.15,8.25,22.5,10.65,"Derek's Daycare ",11,null,null,"Sherman, Richard SEA CB"]
[1170,1170,"Shiancoe, Visanthe FA TE",0,0,null,null,null,null,null,null,null,null,null,0,0,0,null,0,null,null,null,"Free Agent","-",null,null,"Shiancoe, Visanthe FA TE"]
[1171,1171,"Shields, Sam GBP CB",86,8.6,3,0,4,6,10,13.5,null,null,null,"B",null,null,null,16.95,7.5,18.3,6.75,"Free Agent",10,null,null,"Shields, Sam GBP CB"]
[1172,1172,"Shipley, Jordan JAC WR",66.5,9.5,null,null,-2.33,null,null,"B",null,null,null,null,null,3.98,5.65,11.75,4.4000000000000004,16.850000000000001,26.2,"Free Agent",6,null,null,"Shipley, Jordan JAC WR"]
[1173,1173,"Shorts, Cecil JAC WR",210.25,15.018000000000001,18.399999999999999,0,15.85,2.0499999999999998,6.8,"B",16.899999999999999,21.6,9.35,25,18.850000000000001,22.5,22.45,null,17.600000000000001,12.9,null,"Hurry Up and Happy Birthday, Donny (P)",6,null,null,"Shorts, Cecil JAC WR"]
[1174,1174,"Sidbury, Lawrence ATL DE",0.75,7.4999999999999997E-2,null,0,0.75,0,0,0,"B",0,0,0,null,null,null,null,null,0,0,"Free Agent",7,null,null,"Sidbury, Lawrence ATL DE"]
[1175,1175,"Siler, Brandon KCC LB",23.5,1.4690000000000001,0,0,0,0,0,0,"B",0,0,0,0,0,3,3.75,11.25,2.5,3,"Free Agent",7,null,null,"Siler, Brandon KCC LB"]
[1176,1176,"Silva, Ricardo DET S",66.349999999999994,6.6349999999999998,null,null,null,8.5,"B",null,0,17.850000000000001,1.5,7.5,7.5,9.25,3,11.25,null,0,null,"Free Agent",5,null,null,"Silva, Ricardo DET S"]
[1177,1177,"Simpson, Jerome MIN WR",54.9,4.5750000000000002,null,null,null,10,0,null,2.0499999999999998,3.2,2.65,6.55,"B",1.35,5,2.5499999999999998,5.7,8.1999999999999993,7.65,"Free Agent",11,null,null,"Simpson, Jerome MIN WR"]
[1178,1178,"Sims, David PHI S",14,0.93300000000000005,null,0,0,0,0,0,"B",0,14,0,0,0,0,0,0,0,0,"Free Agent",7,null,null,"Sims, David PHI S"]
[1179,1179,"Sims, Ernie DAL LB",58.75,5.875,null,null,null,null,"B",null,null,3,9,9.25,2.25,5.25,5.25,16.5,0,3,5.25,"Free Agent (P)",5,null,null,"Sims, Ernie DAL LB"]
[1180,1180,"Sims, Eugene STL DE",71.45,5.4960000000000004,0,5,1.25,9.6999999999999993,null,0,0,null,"B",null,11,1.25,11.9,6.25,11.1,11.5,2.5,"Free Agent",9,null,null,"Sims, Eugene STL DE"]
[1181,1181,"Sims, Pat CIN DT",47.05,5.8810000000000002,null,null,null,null,null,null,null,"B",null,11.3,0,6.25,7.5,0,0,13.25,8.75,"Free Agent (Q)",8,null,null,"Sims, Pat CIN DT"]
[1182,1182,"Skelton, John ARI QB",11.74,1.677,2.16,null,null,null,null,-1.2,2.48,4.7,16.3,"B",0.24,null,null,-12.94,null,null,null,"Free Agent",10,null,null,"Skelton, John ARI QB"]
[1183,1183,"Skrine, Buster CLE CB",135.5,8.4689999999999994,14,10.5,9.5,8,16.5,13.5,9.75,5.5,4.5,"B",13,5.5,9.5,1.5,0,12.75,1.5,"Free Agent",10,null,null,"Skrine, Buster CLE CB"]
[1184,1184,"Skuta, Dan CIN LB",16.5,1.0309999999999999,1.5,0,0,1.5,0,3.75,0.75,"B",0,1.5,0,0,0,0.75,0,0,6.75,"Free Agent",8,null,null,"Skuta, Dan CIN LB"]
[1185,1185,"Slater, Matt NEP WR",1.56,9.8000000000000004E-2,0.76,0,0,0,0,0,0,0,"B",0,0,0,0,0,0,0.8,0,"Free Agent",9,null,null,"Slater, Matt NEP WR"]
[1186,1186,"Smelley, Brad CLE TE",1.8,0.9,null,null,null,null,null,null,null,null,null,"B",null,null,null,null,null,1.8,0,"Free Agent (Q)",10,null,null,"Smelley, Brad CLE TE"]
[1187,1187,"Smith, Aldon SFO LB",236.5,14.781000000000001,10.75,17.100000000000001,4.5,21.85,1.5,2.25,11.95,22.8,"B",23.6,53.25,16.55,10.35,21.95,8.85,5.25,4,"The Black Champion (Q)",9,null,null,"Smith, Aldon SFO LB"]
[1188,1188,"Smith, Alex CLE TE",24.2,2.0169999999999999,1.4,7.5,null,null,null,0,null,1.6,5.3,"B",1.7,0,1.6,0,3.8,1.3,0,"Free Agent",10,null,null,"Smith, Alex CLE TE"]
[1189,1189,"Smith, Alex SFO QB",112.71,11.271000000000001,15.74,16.739999999999998,6.76,4.92,37.049999999999997,-3.5,6.7,21.88,"B",6.38,null,null,null,null,null,null,0.04,"Roddy White Man Can't Jump",9,null,null,"Smith, Alex SFO QB"]
[1190,1190,"Smith, Alfonso ARI RB",4.0999999999999996,0.373,null,null,null,0,2.2999999999999998,0,0,0,0,"B",0,null,null,0,0,1.8,0,"Free Agent",10,null,null,"Smith, Alfonso ARI RB"]
[1191,1191,"Smith, Alphonso FA CB",16.38,4.0949999999999998,null,null,null,null,null,null,10.25,6,0,0.13,null,null,null,null,null,null,null,"Free Agent","-",null,null,"Smith, Alphonso FA CB"]
[1192,1192,"Smith, Antone ATL RB",0,0,0,0,null,null,0,null,"B",0,0,0,0,0,0,0,0,0,0,"Free Agent (P)",7,null,null,"Smith, Antone ATL RB"]
[1193,1193,"Smith, Antonio HOU DE",132.35,8.2720000000000002,4.6500000000000004,8.4,3.75,11.6,3.75,5,21.2,"B",0,1.25,5,8.5,16.899999999999999,1.25,11.9,12.5,16.7,"Free Agent",8,null,null,"Smith, Antonio HOU DE"]
[1194,1194,"Smith, Armond CAR RB",5.24,1.31,null,null,null,null,null,"B",null,null,null,null,null,null,null,2.16,1.04,1.04,1,"Free Agent",6,null,null,"Smith, Armond CAR RB"]
[1195,1195,"Smith, Brad BUF WR",84.64,5.6429999999999998,null,0.05,0.6,13.4,5.97,3.14,12.31,"B",0.6,0.52,0,1.28,6.77,2.73,9.99,10.98,16.3,"Free Agent (P)",8,null,null,"Smith, Brad BUF WR"]
[1196,1196,"Smith, D'Anthony JAC DT",21,2.625,3.5,2.5,2.5,2.5,3.75,"B",3.75,null,2.5,0,null,null,null,null,null,null,null,"Free Agent (P)",6,null,null,"Smith, D'Anthony JAC DT"]
[1197,1197,"Smith, D.J. GBP LB",76.3,12.717000000000001,13.5,14.8,7,15,21.5,4.5,null,null,null,"B",null,null,null,null,null,null,null,"Free Agent",10,null,null,"Smith, D.J. GBP LB"]
[1198,1198,"Smith, Daryl JAC LB",8.75,4.375,null,null,null,null,null,"B",null,null,null,null,null,null,null,null,null,6,2.75,"Hurry Up and Happy Birthday, Donny",6,null,null,"Smith, Daryl JAC LB"]
[1199,1199,"Smith, Eric NYJ S",38.26,3.1880000000000002,null,0,4,0,5.51,null,null,null,"B",0.75,12.5,6.25,2.5,1.5,1.5,0,3.75,"Free Agent",9,null,null,"Smith, Eric NYJ S"]
[1200,1200,"Smith, Harrison MIN S",199.7,12.481,10,10,8.5,9,5.5,4,23.35,15.5,8.25,6,"B",9,21.75,26.6,12.75,22,7.5,"Aaron Hernandez's Pistol Offense",11,null,null,"Smith, Harrison MIN S"]
[1201,1201,"Smith, Hayden NYJ TE",3.1,0.77500000000000002,null,null,null,null,null,null,null,null,"B",null,null,null,null,0,0,3.1,0,"Free Agent",9,null,null,"Smith, Hayden NYJ TE"]
[1202,1202,"Smith, Jimmy BAL CB",51,4.25,0,4.5,9.25,4,0,13,6,"B",8.25,0,null,null,null,null,3,0,3,"Free Agent",8,null,null,"Smith, Jimmy BAL CB"]
[1203,1203,"Smith, Justin SFO DE",175.3,12.521000000000001,2.5,12.5,8.5,12,10,19,21.5,0,"B",16,10.65,17.7,28.7,12.5,3.75,null,null,"Angry Neighbors (P)",9,null,null,"Smith, Justin SFO DE"]
[1204,1204,"Smith, Kevin DET RB",43.3,3.331,25.1,9,0,0,"B",null,null,1.8,2.7,0,0.4,0.6,0,0,2.2999999999999998,1.4,null,"Free Agent",5,null,null,"Smith, Kevin DET RB"]
[1205,1205,"Smith, Lee BUF TE",19.3,1.206,2,0,0,0,0,0,0,"B",0,2,0,7.6,0,7.7,0,0,0,"Free Agent (P)",8,null,null,"Smith, Lee BUF TE"]
[1206,1206,"Smith, Malcolm SEA LB",36,2.25,0,2,0,3,0,0,0,0,0,0,"B",0,4,12.25,4,3.75,7,"Free Agent",11,null,null,"Smith, Malcolm SEA LB"]
[1207,1207,"Smith, Michael TBB RB",2.2000000000000002,2.2000000000000002,2.2000000000000002,null,null,null,"B",null,null,null,null,null,null,null,null,null,null,null,null,"Free Agent",5,null,null,"Smith, Michael TBB RB"]
[1208,1208,"Smith, Rusty TEN QB",1.36,1.36,null,null,null,null,1.36,null,null,null,null,null,"B",null,null,null,null,null,null,"Free Agent",11,null,null,"Smith, Rusty TEN QB"]
[1209,1209,"Smith, Sean MIA CB",136.1,8.5060000000000002,3,11,5.5,32.1,16,10,"B",6.25,9.25,6.75,12,4.5,0,6,5.5,6,2.25,"Free Agent",7,null,null,"Smith, Sean MIA CB"]
[1210,1210,"Smith, Shaun KCC DT",26,3.25,null,null,null,null,null,null,"B",null,null,0,2.5,0,2.5,3.75,2.5,2.5,12.25,"Free Agent",7,null,null,"Smith, Shaun KCC DT"]
[1211,1211,"Smith, Steve CAR WR",235.35,14.709,19.350000000000001,15.15,13.6,6.95,9,"B",17.05,21.55,13.85,3.35,12.35,11,25.25,19.649999999999999,20.7,15.5,11.05,"Klingon Warriors",6,null,null,"Smith, Steve CAR WR"]
[1212,1212,"Smith, Steve STL WR",30.6,3.4,2.85,7.65,2.75,null,null,4.3,7.6,0,"B",3.6,null,null,1.85,0,null,null,null,"Free Agent",9,null,null,"Smith, Steve STL WR"]
[1213,1213,"Smith, Torrey BAL WR",200.65,12.541,10.5,8.6,32.200000000000003,23.2,7.55,10.9,9.1,"B",15.6,22.2,1.95,24.15,7.05,3.35,2.65,22.05,-0.4,"Aaron Hernandez's Pistol Offense",8,null,null,"Smith, Torrey BAL WR"]
[1214,1214,"Smith, Will NOS DE",118.75,7.4219999999999997,4.25,8,13.65,3,9.0500000000000007,"B",6,5.25,17.850000000000001,7.75,13.55,6,2.75,3.5,11.9,0,6.25,"Free Agent",6,null,null,"Smith, Will NOS DE"]
[1215,1215,"Snelling, Jason ATL RB",61.24,3.827,0.5,1.8,2.5,3.5,2.1,-0.1,"B",10.7,3.6,3.2,2.4,6.3,6.8,1.78,8.3000000000000007,2.56,5.3,"Free Agent",7,null,null,"Snelling, Jason ATL RB"]
[1216,1216,"So'oto, Vic WAS LB",0,0,null,null,null,null,null,0,0,0,null,"B",0,null,0,null,null,null,null,"Free Agent",10,null,null,"So'oto, Vic WAS LB"]
[1217,1217,"Soliai, Paul MIA DT",83.65,5.2279999999999998,7,5,5,4.75,7.05,3.5,"B",10.5,8.5,2.5,2.5,8.3000000000000007,5.8,0,0,5,8.25,"Free Agent (P)",7,null,null,{"$f":"IF(ISBLANK(C1227),\"\",C1227)","v":"Soliai, Paul MIA DT"}]
[1218,1218,"Sopoaga, Isaac SFO DT",68.099999999999994,4.54,0,5,6.25,null,0,2.5,2.5,3.5,"B",5,6.25,3.75,6,7.5,0,12.35,7.5,"Free Agent",9,null,null,"Sopoaga, Isaac SFO DT"]
[1219,1219,"Spaeth, Matt CHI TE",17.8,1.113,0,1.9,0,0,0,"B",0,0,0,4.9000000000000004,0,8.8000000000000007,0,0,0,0,2.2000000000000002,"Free Agent (O)",6,null,null,"Spaeth, Matt CHI TE"]
[1220,1220,"Spears, Marcus DAL DE",50.2,3.347,5.5,6.25,2.5,3,"B",null,2.5,1.25,0,0,3.75,2.5,3,3.75,8.6999999999999993,5,2.5,"Free Agent",5,null,null,"Spears, Marcus DAL DE"]
[1221,1221,"Spencer, Anthony DAL LB",283.8,20.271000000000001,13.5,30.05,15.5,null,"B",null,18.25,8.75,13.5,13.8,28.35,34.049999999999997,19.75,33.1,16.149999999999999,15.25,23.8,"Aaron Hernandez's Pistol Offense (Q)",5,null,null,"Spencer, Anthony DAL LB"]
[1222,1222,"Spencer, Shawntae OAK CB",4.5,2.25,1.5,3,null,null,"B",null,null,null,null,null,null,null,null,null,null,null,null,"Free Agent",5,null,null,"Spencer, Shawntae OAK CB"]
[1223,1223,"Sperry, Kory ARI TE",0,0,null,null,null,null,null,null,null,null,null,"B",null,null,null,null,null,null,0,"Free Agent (P)",10,null,null,"Sperry, Kory ARI TE"]
[1224,1224,"Spievey, Amari DET S",24.75,4.95,1.5,1.5,4.5,null,"B",6.75,10.5,null,null,null,null,null,null,null,null,null,null,"Free Agent (P)",5,null,null,"Spievey, Amari DET S"]
[1225,1225,"Spikes, Brandon NEP LB",157.44999999999999,10.497,1.5,14,4.5,18,8.5,8.75,20.45,17,"B",17.5,9,19,11,1.5,6.75,null,0,"Free Agent",9,null,null,"Spikes, Brandon NEP LB"]
[1226,1226,"Spikes, Takeo SDC LB",112.75,7.0469999999999997,6.75,1.5,18,7,4.5,7.75,"B",7.5,5.25,2.25,5.5,13.75,11.25,3,15,2.25,1.5,"Free Agent",7,null,null,"Spikes, Takeo SDC LB"]
[1227,1227,"Spiller, C.J. BUF RB",264.44,16.527000000000001,29.78,32,13.8,2.8,2.4,21,16.2,"B",15.2,17.100000000000001,16,12.3,16.399999999999999,6.2,19.100000000000001,25.06,19.100000000000001,"Polk High",8,null,null,"Spiller, C.J. BUF RB"]
[1228,1228,"Spillman, C.J. SFO S",7,0.438,0,0,0,1.5,1.5,0,0,0,"B",1.5,0,0,0,2.5,0,0,0,"Free Agent",9,null,null,"Spillman, C.J. SFO S"]
[1229,1229,"Spitler, Austin MIA LB",3,0.2,0,0,0,null,0,0,"B",3,0,0,0,0,0,0,0,0,0,"Free Agent",7,null,null,"Spitler, Austin MIA LB"]
[1230,1230,"Sproles, Darren NOS RB",249.6,19.2,21.55,29.88,11.61,21.31,10.79,"B",16.899999999999999,18.43,null,null,null,13.7,13.83,24.73,17.829999999999998,24.47,24.57,"Roddy White Man Can't Jump",6,null,null,"Sproles, Darren NOS RB"]
[1231,1231,"Spurlock, Micheal SDC WR",94.67,6.7619999999999996,0,0,0.53,0,null,null,"B",0.35,16.22,14.36,4.3,0.96,null,18.48,5.54,15.77,13.63,"Free Agent",7,null,null,"Spurlock, Micheal SDC WR"]
[1232,1232,"Stafford, Matthew DET QB",292.35000000000002,18.271999999999998,15.05,11.2,18.32,18.350000000000001,"B",25.25,11.62,35.799999999999997,10.199999999999999,28.25,3.84,35.159999999999997,23.45,15.46,-1.1599999999999999,24.78,16.78,"Rancho Cucamonga Ghosts",5,null,null,"Stafford, Matthew DET QB"]
[1233,1233,"Stallworth, Donte' NEP WR",14.55,14.55,null,null,null,null,null,null,null,null,"B",null,null,null,null,14.55,null,null,null,"Free Agent (Q)",9,null,null,"Stallworth, Donte' NEP WR"]
[1234,1234,"Stanford, Julian JAC LB",24.25,1.516,0,0,3.25,1.5,1.5,"B",4.5,2.25,0,0,3.75,1.5,1.5,1.5,3,0,0,"Free Agent",6,null,null,"Stanford, Julian JAC LB"]
[1235,1235,"Stanford, RJ MIA CB",22.25,1.391,0,0,0,0,0.75,0,"B",0,1.5,0,5.5,4.5,2.25,4,2.25,1.5,0,"Free Agent",7,null,null,"Stanford, RJ MIA CB"]
[1236,1236,"Starks, James GBP RB",37.6,6.2670000000000003,null,null,null,null,null,1.1000000000000001,null,2.7,5.0999999999999996,"B",9,3.5,16.2,null,null,null,null,"Free Agent",10,null,null,"Starks, James GBP RB"]
[1237,1237,"Starks, Randy MIA DT",103.65,6.4779999999999998,26.95,5,11.5,1.25,20,2.5,"B",9.25,0,0,9.9499999999999993,5,2.5,0,2.5,3.5,3.75,"Free Agent (Q)",7,null,null,"Starks, Randy MIA DT"]
[1238,1238,"Steltz, Craig CHI S",11.45,0.88100000000000001,0,0,0,3,0,"B",0,0.2,1.5,0,0,0,3.75,3,null,null,null,"Free Agent",6,null,null,"Steltz, Craig CHI S"]
[1239,1239,"Stephens, Emmanuel CLE DE",23.43,2.9289999999999998,3.28,0,0,0.75,3,13.4,1.5,1.5,null,"B",null,null,null,null,null,null,null,"Free Agent",10,null,null,"Stephens, Emmanuel CLE DE"]
[1240,1240,"Stephens-Howling, LaRod ARI RB",105.5,7.5359999999999996,8.68,4.38,-0.92,null,null,2.2000000000000002,24.9,6.8,13.9,"B",23.3,0.1,1,7.22,5.42,4.26,4.26,"Free Agent",10,null,null,"Stephens-Howling, LaRod ARI RB"]
[1241,1241,"Stevens, Craig TEN TE",64,4.2670000000000003,2,8.1,13.8,11.4,1.4,1.9,3.2,4.5,2.6,2.2000000000000002,"B",2.7,0,3.4,4.5999999999999996,2.2000000000000002,null,"Free Agent",11,null,null,"Stevens, Craig TEN TE"]
[1242,1242,"Stewart, Darian STL S",9,0.75,null,null,0,0,4.5,0,0,0,"B",null,null,0,0,4.5,0,0,0,"Free Agent",9,null,null,"Stewart, Darian STL S"]
[1243,1243,"Stewart, Jeremy OAK RB",26.02,6.5049999999999999,null,null,null,null,"B",null,null,null,null,2.2000000000000002,5.08,12.3,6.44,null,null,null,null,"Free Agent",5,null,null,"Stewart, Jeremy OAK RB"]
[1244,1244,"Stewart, Jonathan CAR RB",77.3,8.5890000000000004,null,13.8,null,5.8,5.0999999999999996,"B",7.6,12,6.7,6.4,14.3,5.6,null,null,null,null,null,"Derek's Daycare (O)",6,null,null,"Stewart, Jonathan CAR RB"]
[1245,1245,"Still, Devon CIN DT",30.45,3.806,5,0,1.25,0,2.5,3,9.9499999999999993,"B",8.75,null,null,null,null,null,null,null,null,"Free Agent",8,null,null,"Still, Devon CIN DT"]
[1246,1246,"Stocker, Luke TBB TE",46.5,2.9060000000000001,0,0,7.6,2,"B",0,4.8,0,1.7,2.6,0,2,4.9000000000000004,0,6.8,4.5999999999999996,9.5,"Free Agent (P)",5,null,null,"Stocker, Luke TBB TE"]
[1247,1247,"Stokley, Brandon DEN WR",140.65,9.3770000000000007,5.0999999999999996,6.45,20.8,5.7,9.5,15.8,"B",4.4000000000000004,8.0500000000000007,16.399999999999999,16.5,11.2,null,0,2.65,9.4499999999999993,8.65,"Free Agent",7,null,null,"Stokley, Brandon DEN WR"]
[1248,1248,"Stovall, Maurice FA WR",0,0,null,null,0,0,0,null,0,0,0,0,0,0,0,null,null,null,null,"Free Agent","-",null,null,"Stovall, Maurice FA WR"]
[1249,1249,"Streater, Rod OAK WR",126.15,7.8840000000000003,12.7,4.4000000000000004,4.7,0,"B",6.15,6.6,2.15,16.399999999999999,2.35,5.0999999999999996,0,20.350000000000001,16,12.45,4.0999999999999996,12.7,"Roddy White Man Can't Jump",5,null,null,"Streater, Rod OAK WR"]
[1250,1250,"Stroughter, Sammie TBB WR",3.72,1.24,0,3.72,0,null,"B",null,null,null,null,null,null,null,null,null,null,null,null,"Free Agent",5,null,null,"Stroughter, Sammie TBB WR"]
[1251,1251,"Stuckey, Darrell SDC S",8.5,0.70799999999999996,0,0,0,0,0,3,"B",0,2.5,0,3,0,null,0,null,null,null,"Free Agent",7,null,null,"Stuckey, Darrell SDC S"]
[1252,1252,"Studebaker, Andy KCC LB",5.25,0.32800000000000001,2.25,0,0,0,0,0,"B",0,0,0,0,0,0,1.5,0,1.5,0,"Free Agent",7,null,null,"Studebaker, Andy KCC LB"]
[1253,1253,"Succop, Ryan KCC PK",97,6.0620000000000003,5,5,20,2,6,4,"B",12,7,4.5,6,9.5,11,-2,0,7,0,"Free Agent",7,null,null,"Succop, Ryan KCC PK"]
[1254,1254,"Suggs, Terrell BAL DE",54.5,6.8120000000000003,null,null,null,null,null,null,14.55,"B",4.5,8.75,3,15.2,4,null,1.5,3,null,"Polk High",8,null,null,"Suggs, Terrell BAL DE"]
[1255,1255,"Suh, Ndamukong DET DT",143.19999999999999,8.9499999999999993,13.2,12.7,5,8.25,"B",8.5,9.3000000000000007,7,0,11.7,9.25,0,24.45,1.25,13.45,10.15,9,"Klingon Warriors",5,null,null,"Suh, Ndamukong DET DT"]
[1256,1256,"Suisham, Shaun PIT PK",122.4,7.65,7,10,7,"B",10,12.5,11.5,9.5,5.9,10,4,2,12.5,6.5,6,1.5,6.5,"Free Agent",4,null,null,"Suisham, Shaun PIT PK"]
[1257,1257,"Sylvester, Stevenson PIT LB",0,0,null,null,null,"B",0,0,0,0,null,null,null,0,0,0,0,0,0,"Free Agent",4,null,null,"Sylvester, Stevenson PIT LB"]
[1258,1258,"Ta'ufo'ou, Will JAC RB",1.5,0.3,null,null,null,null,null,"B",null,null,null,0,0,1.5,null,0,0,null,null,"Free Agent",6,null,null,"Ta'ufo'ou, Will JAC RB"]
[1259,1259,"Talib, Aqib NEP CB",103.65,10.365,8.25,22,18,7,null,null,null,null,"B",null,28.4,2.25,3.75,7,7,0,null,"Hurry Up and Happy Birthday, Donny",9,null,null,"Talib, Aqib NEP CB"]
[1260,1260,"Tamme, Jacob DEN TE",145.5,9.0939999999999994,17.8,4.3,7.6,11.3,14,5.7,"B",7.8,6.3,2.1,11.3,16.8,22.4,5.4,0,9.9,2.8,"Free Agent (P)",7,null,null,"Tamme, Jacob DEN TE"]
[1261,1261,"Tandy, Keith TBB S",0,0,0,0,null,null,"B",null,null,null,null,0,null,0,0,0,0,0,0,"Free Agent",5,null,null,"Tandy, Keith TBB S"]
[1262,1262,"Tannehill, Ryan MIA QB",149.78,9.3610000000000007,-4.34,19.399999999999999,6.14,21.86,6.52,15,"B",-0.28000000000000003,13.5,-1.42,2.34,14.42,8.34,11.5,22,17.600000000000001,-2.8,"Invictus",7,null,null,"Tannehill, Ryan MIA QB"]
[1263,1263,"Tanner, Phillip DAL RB",14.2,1.014,0,0,0,4,"B",3.1,4.8,2.2999999999999998,0,0,0,0,0,0,null,0,null,"Free Agent",5,null,null,"Tanner, Phillip DAL RB"]
[1264,1264,"Tapp, Darryl PHI DE",29.05,2.2349999999999999,1.5,0,11.3,0,0,1.5,"B",1.5,null,3,4.75,0,3,0,2.5,null,null,"Free Agent",7,null,null,"Tapp, Darryl PHI DE"]
[1265,1265,"Tate, Ben HOU RB",52.8,4.8,5.8,25.7,-0.4,3.4,null,1.4,4.7,"B",null,null,null,null,1.8,5.5,1.3,2.9,0.7,"Klingon Warriors",8,null,null,"Tate, Ben HOU RB"]
[1266,1266,"Tate, Brandon CIN WR",80.23,5.0140000000000002,5.38,20.73,2.87,2.2000000000000002,1.96,6.66,5.91,"B",7.19,-4.57,5.56,3.38,1.31,2.2000000000000002,3.61,3.55,12.29,"Free Agent",8,null,null,"Tate, Brandon CIN WR"]
[1267,1267,"Tate, Golden SEA WR",178.45,11.897,null,7.55,23.55,1.95,12.75,9.4499999999999993,0,12.15,21.9,19.600000000000001,"B",10.6,22.85,3.1,11.15,5.2,16.649999999999999,"Klingon Warriors",11,null,null,"Tate, Golden SEA WR"]
[1268,1268,"Taylor, Brandon SDC S",9.3000000000000007,2.3250000000000002,null,null,null,null,null,null,"B",null,null,null,null,null,1.5,0,1.5,6.3,null,"Free Agent",7,null,null,"Taylor, Brandon SDC S"]
[1269,1269,"Taylor, Ike PIT CB",82.05,6.8369999999999997,5.5,5,9.25,"B",3,13.25,4,5.5,16.55,4,5.5,8,2.5,null,null,null,null,"Free Agent (P)",4,null,null,"Taylor, Ike PIT CB"]
[1270,1270,"Taylor, Phil CLE DT",42.1,5.2629999999999999,null,null,null,null,null,null,null,null,2.5,"B",5,11.1,2.5,3.5,11.25,2.5,3.75,"Free Agent",10,null,null,"Taylor, Phil CLE DT"]
[1271,1271,"Taylor, Ryan GBP TE",2.6,0.16300000000000001,0,0,0,0,0,0,0,0,0,"B",0,0,0,0,0,2.6,0,"Free Agent (Q)",10,null,null,"Taylor, Ryan GBP TE"]
[1272,1272,"Taylor, Tyrod BAL QB",14.46,2.41,1.9,null,null,0,null,null,null,"B",0.4,0,null,null,null,null,null,-0.3,12.46,"Free Agent",8,null,null,"Taylor, Tyrod BAL QB"]
[1273,1273,"Te'o-Nesheim, Daniel TBB DE",113,7.0620000000000003,0,0,0,6.75,"B",8.5,5,12.2,2.5,18.25,14.5,11,3.75,11.7,2.5,2.5,13.85,"Free Agent",5,null,null,"Te'o-Nesheim, Daniel TBB DE"]
[1274,1274,"Tebow, Tim NYJ QB",9.76,0.81299999999999994,1.1000000000000001,2.2000000000000002,-0.5,0.36,1.9,1.62,1.2,0.2,"B",1.72,-0.54,null,null,null,0.5,null,0,"Free Agent",9,null,null,"Tebow, Tim NYJ QB"]
[1275,1275,"Thigpen, Marcus MIA RB",74.97,4.6859999999999999,16.55,4.93,4.28,0.92,2.2000000000000002,2.76,"B",4.8499999999999996,3.96,4.07,15.31,0,1.95,2.83,4.0199999999999996,3.73,2.61,"Free Agent",7,null,null,"Thigpen, Marcus MIA RB"]
[1276,1276,"Thigpen, Tyler BUF QB",1.1000000000000001,0.27500000000000002,null,-0.1,null,0,0,null,null,"B",null,null,null,null,null,null,1.2,null,null,"Free Agent",8,null,null,"Thigpen, Tyler BUF QB"]
[1277,1277,"Thomas, Bryan NYJ LB",54.5,4.5419999999999998,0.75,null,null,7.9,5.5,0,0,12.35,"B",11.25,0,4,9.75,3,null,0,null,"Free Agent",9,null,null,"Thomas, Bryan NYJ LB"]
[1278,1278,"Thomas, Cam SDC DT",45.25,2.8279999999999998,0,0,1.25,3.75,0,2.5,"B",1.75,2.5,0,5,5,0,3.75,6.25,7.25,6.25,"Free Agent",7,null,null,"Thomas, Cam SDC DT"]
[1279,1279,"Thomas, Daniel MIA RB",81.099999999999994,6.758,3.3,null,12,2,10.7,null,"B",11.5,8.1999999999999993,10.5,3.3,14.8,3.9,0.3,0.6,null,null,"Klingon Warriors",7,null,null,"Thomas, Daniel MIA RB"]
[1280,1280,"Thomas, Dave NOS TE",49.1,3.2730000000000001,2,0,0,2.1,0,"B",11.7,0,0,0,0,14.4,null,0,11.1,7.8,0,"Free Agent",6,null,null,"Thomas, Dave NOS TE"]
[1281,1281,"Thomas, Demaryius DEN WR",320.5,20.030999999999999,24.25,23.8,4.1500000000000004,14.55,29.85,12.2,"B",29.45,16.2,25.75,13.95,19.2,31.9,14.55,6.3,27.45,26.95,"Invictus",7,null,null,{"$f":"IF(ISBLANK(C1291),\"\",C1291)","v":"Thomas, Demaryius DEN WR"}]
[1282,1282,"Thomas, Earl SEA S",135.5,8.4689999999999994,4.5,8,8.5,8.5,4,17.55,6,13,9.75,8.25,"B",5.25,4,5.25,26.2,3.75,3,"Roddy White Man Can't Jump",11,null,null,"Thomas, Earl SEA S"]
[1283,1283,"Thomas, James CHI LB",3,0.188,3,0,0,0,0,"B",0,0,0,0,0,0,0,0,0,0,0,"Free Agent",6,null,null,"Thomas, James CHI LB"]
[1284,1284,"Thomas, Josh CAR CB",57.75,3.609,0,0,0,0,7,"B",6,0.75,0.75,5.25,8,1.5,4,5.5,3,5.5,10.5,"Free Agent",6,null,null,"Thomas, Josh CAR CB"]
[1285,1285,"Thomas, Julius DEN TE",0,0,0,0,0,0,null,null,"B",null,null,null,null,null,null,null,null,null,null,"Hurry Up and Happy Birthday, Donny",7,null,null,"Thomas, Julius DEN TE"]
[1286,1286,"Thomas, Mike DET WR",47.57,2.9729999999999999,-2.0299999999999998,4.58,3.38,2.15,"B",null,4.76,6.9,0,0,1.08,11.6,1.1499999999999999,2.5,0.5,2.5499999999999998,1.95,"Free Agent",5,null,null,"Thomas, Mike DET WR"]
[1287,1287,"Thomas, Pierre NOS RB",139.34,9.2889999999999997,3.9,19.3,10.6,3.3,9,"B",9.1999999999999993,6.9,11.52,2.6,8.8000000000000007,0,9.9,15.64,6.9,21.78,null,"Roddy White Man Can't Jump",6,null,null,"Thomas, Pierre NOS RB"]
[1288,1288,"Thompson, Brandon CIN DT",2.5,0.83299999999999996,2.5,0,null,0,null,null,null,"B",null,null,null,null,null,null,null,null,null,"Free Agent",8,null,null,"Thompson, Brandon CIN DT"]
[1289,1289,"Thompson, Christian BAL S",0,0,0,0,0,0,null,null,0,"B",0,null,null,null,null,null,null,null,null,"Free Agent",8,null,null,"Thompson, Christian BAL S"]
[1290,1290,"Thompson, Deonte BAL WR",23.91,3.9849999999999999,7.27,4,3.24,2.72,-0.92,null,null,"B",null,null,null,null,null,null,null,null,7.6,"Free Agent (Q)",8,null,null,"Thompson, Deonte BAL WR"]
[1291,1291,"Thompson, Taylor TEN TE",13.6,0.85,0,0,0,0,2.2000000000000002,2,0,0,2.2000000000000002,0,"B",0,0,0,0,2.2999999999999998,4.9000000000000004,"Free Agent",11,null,null,"Thompson, Taylor TEN TE"]
[1292,1292,"Thornton, Cedric PHI DT",66.5,4.1559999999999997,0,0,1.25,7.5,5,5,"B",15.25,1.25,0,0,0,3.75,5,12,5,5.5,"Free Agent",7,null,null,"Thornton, Cedric PHI DT"]
[1293,1293,"Thurmond, Walter SEA CB",4.5,2.25,null,null,null,null,null,null,null,null,null,null,"B",null,0,4.5,null,null,null,"Free Agent",11,null,null,"Thurmond, Walter SEA CB"]
[1294,1294,"Tillman, Charles CHI CB",234.6,14.662000000000001,0,14.5,6,22.75,23.1,"B",21.5,11.75,28,14,11.5,8,20.75,6.75,10.75,26.5,8.75,"BELAC",6,null,null,"Tillman, Charles CHI CB"]
[1295,1295,"Timmons, Lawrence PIT LB",231.35,14.459,7.5,8.75,4.5,"B",17.75,13.9,11.25,3.5,11.6,20.55,9,30.8,5.25,17.5,15.55,26.6,27.35,"Klingon Warriors",4,null,null,"Timmons, Lawrence PIT LB"]
[1296,1296,"Todman, Jordan JAC RB",4.92,4.92,null,null,null,null,null,"B",null,null,null,null,null,null,null,4.92,null,null,null,"Free Agent",6,null,null,"Todman, Jordan JAC RB"]
[1297,1297,"Toeaina, Matt CHI DT",7.5,2.5,3.75,null,null,null,1.25,"B",null,null,null,null,null,null,null,2.5,null,null,null,"Free Agent",6,null,null,"Toeaina, Matt CHI DT"]
[1298,1298,"Tolbert, Mike CAR RB",116.14,7.2590000000000003,4,10.6,9.1,4.2,0.3,"B",6.9,3.2,2.1,6,3.4,4.7,6.9,6.8,21.44,2.8,23.7,"Free Agent (P)",6,null,null,"Tolbert, Mike CAR RB"]
[1299,1299,"Toler, Greg ARI CB",87.95,7.3289999999999997,null,0,1.5,21.5,6,0,null,null,null,"B",8.5,3,5.5,5.5,34.950000000000003,1.5,0,"Free Agent",10,null,null,"Toler, Greg ARI CB"]
[1300,1300,"Tollefson, Dave OAK DE",20.2,1.347,9.1999999999999993,2.5,5,0,"B",0,0,0,3.5,0,0,0,0,0,0,null,0,"Free Agent",5,null,null,"Tollefson, Dave OAK DE"]
[1301,1301,"Torain, Ryan NYG RB",0,0,null,null,null,null,null,null,null,null,null,null,"B",null,null,null,0,0,null,"Free Agent",11,null,null,"Torain, Ryan NYG RB"]
[1302,1302,"Toribio, Anthony KCC DT",11.25,1.0229999999999999,null,null,null,null,2.5,0,"B",2.5,0,0,2.5,0,0,0,0,null,3.75,"Free Agent",7,null,null,"Toribio, Anthony KCC DT"]
[1303,1303,"Toston, Keith JAC RB",17.100000000000001,2.85,0,null,null,null,null,"B",null,1.96,0,null,null,null,null,null,0,0.64,14.5,"Free Agent",6,null,null,"Toston, Keith JAC RB"]
[1304,1304,"Tracy, Adrian NYG DE",24.6,1.538,0,3,0,0,0,16.600000000000001,0,0,0,0,"B",2.5,0,0,0,2.5,0,"Free Agent",11,null,null,"Tracy, Adrian NYG DE"]
[1305,1305,"Trevathan, Danny DEN LB",52.75,3.2970000000000002,0,0,0,1.5,1.5,5.25,"B",7,11.25,5.5,2.5,0,7,5.25,4.5,1.5,0,"Free Agent",7,null,null,"Trevathan, Danny DEN LB"]
[1306,1306,"Trufant, Marcus SEA CB",54,4.5,2.25,1.5,3.75,1.5,0.75,6.75,1.5,9,10.75,3,"B",4.5,null,null,null,null,8.75,"Free Agent",11,null,null,"Trufant, Marcus SEA CB"]
[1307,1307,"Trusnik, Jason MIA LB",16,1,0,0,0,0,0,0,"B",0,1.5,1.5,0,0,0,5.5,3.75,0,3.75,"Free Agent",7,null,null,"Trusnik, Jason MIA LB"]
[1308,1308,"Tryon, Justin NYG CB",10.75,0.67200000000000004,3.75,3,2.5,1.5,0,0,0,0,0,0,"B",0,0,0,0,0,0,"Free Agent",11,null,null,"Tryon, Justin NYG CB"]
[1309,1309,"Tuck, Justin NYG DE",119,7.9329999999999998,6.25,7.5,6.25,7.5,11.25,0,19.3,0,25.8,2.5,"B",2.5,5,10,5,null,10.15,"Free Agent (P)",11,null,null,"Tuck, Justin NYG DE"]
[1310,1310,"Tucker, Justin BAL PK",141,8.8119999999999994,15,14.5,7,5.5,9,7,10,"B",5.5,13.5,6,10.5,8.5,4,5.5,15,4.5,"Free Agent",8,null,null,"Tucker, Justin BAL PK"]
[1311,1311,"Tulloch, Stephen DET LB",171.9,10.744,9,12.5,10.25,9,"B",13.75,14.15,9.25,7.5,4.75,10.75,20.75,4.25,12.75,13.5,5.25,14.5,"I like my Women like I like my coffee, _______.",5,null,null,"Tulloch, Stephen DET LB"]
[1312,1312,"Turbin, Robert SEA RB",73.5,4.5940000000000003,1.7,5.9,0,7.8,3.4,6.8,1.7,6.2,4,2.7,"B",8.6,0.6,10.8,3.8,7.8,1.7,"BELAC (P)",11,null,null,"Turbin, Robert SEA RB"]
[1313,1313,"Turner, Michael ATL RB",176.1,11.006,3.2,11.2,16.100000000000001,27.1,14.9,4.9000000000000004,"B",6.4,17.2,1.5,10.6,12,13,7.4,13.1,9.6999999999999993,7.8,"Free Agent",7,null,null,"Turner, Michael ATL RB"]
[1314,1314,"Turner, Patrick FA WR",0,0,0,null,null,0,null,null,null,null,null,null,null,null,null,null,null,null,null,"Free Agent","-",null,null,"Turner, Patrick FA WR"]
[1315,1315,"Tynes, Lawrence NYG PK",144,9,5,15,19,5,11.5,13,9,18,9.5,7,"B",8.5,9.5,9,-3,2,6,"Free Agent (Q)",11,null,null,"Tynes, Lawrence NYG PK"]
[1316,1316,"Tyson, Deangelo BAL DE",22.5,2.25,null,null,null,null,null,null,3.75,"B",2.5,5,3.75,0,0,0,2.5,0,5,"Free Agent",8,null,null,"Tyson, Deangelo BAL DE"]
[1317,1317,"Umenyiora, Osi NYG DE",135.85,8.4909999999999997,2.5,2.5,9.4,17.600000000000001,9.25,2.5,10.35,2.5,24,7.5,"B",14.6,1.25,10.65,5,11.25,5,"Free Agent",11,null,null,"Umenyiora, Osi NYG DE"]
[1318,1318,"Underwood, Tiquan TBB WR",92.48,6.6059999999999999,null,null,1.95,7.65,"B",10.3,12,6.45,2.4500000000000002,10.7,3.05,13.95,2.4500000000000002,4.83,8.35,3.05,5.3,"Free Agent",5,null,null,"Underwood, Tiquan TBB WR"]
[1319,1319,"Unrein, Mitch DEN DT",42,2.625,1.25,0,5,1.25,3.75,1.25,"B",0,2.5,0,2.5,2.5,2.5,8.25,2.5,6.25,2.5,"Free Agent",7,null,null,"Unrein, Mitch DEN DT"]
[1320,1320,"Upshaw, Courtney BAL LB",97.25,6.0780000000000003,7.35,9.25,6.25,3,5.25,8.5,5.5,"B",3.75,9.5,5.5,8.65,6,6,11.25,1.5,0,"Free Agent",8,null,null,"Upshaw, Courtney BAL LB"]
[1321,1321,"Urlacher, Brian CHI LB",141.85,11.821,4.75,9.75,8.75,7,3,"B",17.25,13.25,32.6,13.25,9.5,5.25,17.5,null,null,null,null,"Free Agent",6,null,null,"Urlacher, Brian CHI LB"]
[1322,1322,"Van Dyke, Demarcus PIT CB",0,0,0,0,0,"B",0,0,0,null,0,null,null,null,null,0,0,null,null,"Free Agent (Q)",4,null,null,"Van Dyke, Demarcus PIT CB"]
[1323,1323,"Vanden Bosch, Kyle DET DE",112.7,7.0439999999999996,7.5,8.8000000000000007,3.5,12.35,"B",13.45,11.6,6,10,5,6.25,2.5,6,1.25,5,5.5,8,"Free Agent",5,null,null,"Vanden Bosch, Kyle DET DE"]
[1324,1324,"Vaughn, Cassius IND CB",135.16,8.4469999999999992,2.04,0,4.5199999999999996,"B",5.25,5.94,7,8.11,7.5,10.5,2.25,8,17.75,30.8,6,4.5,15,"Free Agent (Q)",4,null,null,"Vaughn, Cassius IND CB"]
[1325,1325,"Vereen, Shane NEP RB",70,5.3849999999999998,null,null,null,1.5,6.1,0,6.9,10.9,"B",2.6,12.1,22.3,1.4,4,-1.6,0,3.8,"Aaron Hernandez's Pistol Offense",9,null,null,"Vereen, Shane NEP RB"]
[1326,1326,"Verner, Alterraun TEN CB",152.6,9.5370000000000008,12.25,19.600000000000001,19.75,7.75,11.25,4.5,7.5,13,3,7,"B",11.5,7,9,4.5,7.5,7.5,"Free Agent",11,null,null,"Verner, Alterraun TEN CB"]
[1327,1327,"Vernon, Olivier MIA DE",81.349999999999994,5.0839999999999996,2.5,0,9.5500000000000007,3,2.5,23.1,"B",3.25,4.5,5,6.25,3.75,2.5,0,0,11.7,3.75,"Free Agent",7,null,null,"Vernon, Olivier MIA DE"]
[1328,1328,"Vick, Michael PHI QB",129.16999999999999,12.917,14.55,21.95,-0.82,17.54,8.6,22.85,"B",13.84,11.18,8.5,null,null,null,null,null,null,10.98,"Hurry Up and Happy Birthday, Donny",7,null,null,"Vick, Michael PHI QB"]
[1329,1329,"Vickers, Lawrence DAL RB",25.06,1.5660000000000001,0,0,1.5,0,"B",2.66,1.7,0,1.5,4.9000000000000004,1.3,3.1,0,3.8,2.5,0,2.1,"Free Agent",5,null,null,"Vickers, Lawrence DAL RB"]
[1330,1330,"Vickerson, Kevin DEN DT",107.6,6.7249999999999996,2.5,8.75,14,5,9.75,7.5,"B",5,2.5,19.350000000000001,7.5,5,6.25,0,0,0,14.5,"Free Agent",7,null,null,"Vickerson, Kevin DEN DT"]
[1331,1331,"Vilma, Jonathan NOS LB",71.849999999999994,6.532,null,null,null,null,null,"B",2.5,5.25,6.75,1.25,11.3,4.5,4.75,4.5,3.75,1.5,25.8,"Free Agent (Q)",6,null,null,"Vilma, Jonathan NOS LB"]
[1332,1332,"Vinatieri, Adam IND PK",122.5,7.6559999999999997,2,13,4,"B",11.5,11,5,6.5,12,9.5,6.5,8,5,11,5,8.5,4,"Free Agent",4,null,null,"Vinatieri, Adam IND PK"]
[1333,1333,"Wade, Trevin CLE CB",16.75,1.5229999999999999,null,0.75,null,null,1.5,0,0,0,0,"B",7.75,0,0,null,null,3,3.75,"Free Agent",10,null,null,"Wade, Trevin CLE CB"]
[1334,1334,"Wagner, Bobby SEA LB",222.35,13.897,3.5,5.25,9.75,13.5,16.649999999999999,17.25,11.25,14,18.95,8.25,"B",23,15,28.5,16.5,9.75,11.25,"Rancho Cucamonga Ghosts",11,null,null,"Wagner, Bobby SEA LB"]
[1335,1335,"Wake, Cameron MIA DE",227.85,14.241,7.25,2.5,11.25,41.25,15.25,13.9,"B",9.1999999999999993,20.399999999999999,3.75,15.55,3.5,16.149999999999999,37.299999999999997,6.25,18.100000000000001,6.25,"Derek's Daycare ",7,null,null,"Wake, Cameron MIA DE"]
[1336,1336,"Walden, Erik GBP LB",96.05,6.4029999999999996,null,7.25,5.25,2,8.75,0,15,2.25,9.9499999999999993,"B",20.350000000000001,1.5,0,6,1.5,11.75,4.5,"Free Agent",10,null,null,"Walden, Erik GBP LB"]
[1337,1337,"Walker, Delanie SFO TE",82.4,5.15,0,2.2000000000000002,1.6,6.1,0,0,8.6999999999999993,6.8,"B",0,2.4,14.6,2.2000000000000002,3.5,8.9,17.399999999999999,8,"Free Agent (O)",9,null,null,"Walker, Delanie SFO TE"]
[1338,1338,"Walker, Reggie ARI LB",14.5,0.96699999999999997,6,0,0,0,0,0,null,0,0,"B",1.5,0,0,2.5,4.5,0,0,"Free Agent",10,null,null,"Walker, Reggie ARI LB"]
[1339,1339,"Walker, Vance ATL DT",91.75,5.734,2.5,11.8,7.5,17,1.25,0,"B",2.5,4.25,5,6,0,3.75,11.7,1.25,5,12.25,"Free Agent",7,null,null,"Walker, Vance ATL DT"]
[1340,1340,"Wallace, Mike PIT WR",211.3,14.087,14.7,19.649999999999999,26.4,"B",4.2,18.899999999999999,15.9,14.95,17.350000000000001,11.15,4.4000000000000004,2.15,10.65,32.950000000000003,15.5,2.4500000000000002,null,"Polk High",4,null,null,"Wallace, Mike PIT WR"]
[1341,1341,"Walsh, Blair MIN PK",155.5,9.7189999999999994,16,9.5,7.5,8.5,12.5,12,3,6.5,9.5,14.5,"B",1.5,1,3,23,13,14.5,"Free Agent",11,null,null,"Walsh, Blair MIN PK"]
[1342,1342,"Walter, Kevin HOU WR",116.05,7.2530000000000001,4.0999999999999996,7.15,18.05,2.0499999999999998,9.6,5.3,18.399999999999999,"B",5.3,5.5,12.9,4.5,8.3000000000000007,0,3.6,2.4500000000000002,8.85,"Free Agent (O)",8,null,null,"Walter, Kevin HOU WR"]
[1343,1343,"Walters, Anthony CHI S",15.5,0.96899999999999997,0,0,0,0,0,"B",0,0,0,0,0,0,0,0,2.5,3,10,"Free Agent",6,null,null,"Walters, Anthony CHI S"]
[1344,1344,"Ward, T.J. CLE S",125.7,8.9789999999999992,22.25,11.75,9.75,4.5,4.5,4.5,11.5,3,7.5,"B",2.25,13.75,3.75,7,19.7,null,null,"Free Agent",10,null,null,"Ward, T.J. CLE S"]
[1345,1345,"Ware, D.J. TBB RB",30.1,1.881,1.4,2.42,2.2999999999999998,3.5,"B",3.6,2,1.7,2.2000000000000002,-0.1,5.5,0,0.8,-0.7,5.48,0,0,"Free Agent",5,null,null,{"$f":"IF(ISBLANK(C1355),\"\",C1355)","v":"Ware, D.J. TBB RB"}]
[1346,1346,"Ware, Demarcus DAL LB",207.95,12.997,26.6,14,29.15,16.7,"B",8.9,20.05,13.7,21.85,9.5500000000000007,9.5500000000000007,3.75,5,15.05,6.85,5.5,1.75,"Polk High",5,null,null,"Ware, Demarcus DAL LB"]
[1347,1347,"Warren, Ty DEN DT",2.5,2.5,2.5,null,null,null,null,null,"B",null,null,null,null,null,null,null,null,null,null,"Free Agent",7,null,null,"Warren, Ty DEN DT"]
[1348,1348,"Washington, Daryl ARI LB",268.8,16.8,21.1,22,15.55,16.55,14.75,22.5,25.55,22.2,8.25,"B",24.2,18.149999999999999,15.25,6.25,10,12.25,14.25,"Hurry Up and Happy Birthday, Donny (S)",10,null,null,"Washington, Daryl ARI LB"]
[1349,1349,"Washington, Leon SEA RB",79.489999999999995,4.968,9.2200000000000006,2.37,3.11,3.03,1.4,5.43,0.73,8.25,2.16,3.25,"B",12.88,2.4700000000000002,13.12,4.47,3.65,3.95,"Free Agent",11,null,null,"Washington, Leon SEA RB"]
[1350,1350,"Washington, Nate TEN WR",155.1,9.6940000000000008,13.8,4.5,21.95,8.0500000000000007,9.6,9.4499999999999993,14.8,13.15,12,1.75,"B",10.4,14.35,2.75,11.2,4,3.35,"Free Agent",11,null,null,"Washington, Nate TEN WR"]
[1351,1351,"Watson, Ben CLE TE",138.6,8.6620000000000008,3.9,4.2,4.5,12.7,1.6,9.6,8.1,2.9,5.2,"B",22.7,7.1,17,8.8000000000000007,4.2,9.1999999999999993,16.899999999999999,"Free Agent",10,null,null,"Watson, Ben CLE TE"]
[1352,1352,"Watson, Dekoda TBB LB",12,0.75,0,1.5,0,0,"B",0,0,0,0,2,2.5,0,1.5,2.5,0,0,2,"Free Agent",5,null,null,"Watson, Dekoda TBB LB"]
[1353,1353,"Watt, J.J. HOU DE",409.1,25.568999999999999,23.45,29.35,34.35,28.45,26.5,28.75,10,"B",18.850000000000001,6,27.6,38.700000000000003,40.1,10.5,51.2,18.8,16.5,"The Black Champion",8,null,null,"Watt, J.J. HOU DE"]
[1354,1354,"Wayne, Reggie IND WR",301.86,18.866,24.75,20.6,18.8,"B",49.81,11.95,14.8,17.850000000000001,22.55,19.600000000000001,15.95,20.2,10.1,20.399999999999999,5.15,20.350000000000001,9,"I like my Women like I like my coffee, _______.",4,null,null,"Wayne, Reggie IND WR"]
[1355,1355,"Weatherspoon, Sean ATL LB",167.35,12.872999999999999,20.8,17.25,10.5,11.25,20.45,12,"B",8.25,null,null,null,10,12.35,6.75,11.25,12,14.5,"The Black Champion (Q)",7,null,null,"Weatherspoon, Sean ATL LB"]
[1356,1356,"Webb, Joe MIN QB",-0.1,-0.1,null,null,null,null,-0.1,null,null,null,null,null,"B",null,null,null,null,null,null,"Free Agent",11,null,null,"Webb, Joe MIN QB"]
[1357,1357,"Webb, Lardarius BAL CB",63.65,10.608000000000001,16.100000000000001,12.75,5.5,16.5,12.8,0,null,"B",null,null,null,null,null,null,null,null,null,"Invictus (Q)",8,null,null,"Webb, Lardarius BAL CB"]
[1358,1358,"Webster, Corey NYG CB",139.5,8.7189999999999994,5.5,11.25,6,4.5,11.25,4.5,6,18.8,13.7,10.25,"B",12,3,4,4.5,18.75,5.5,"Free Agent (P)",11,null,null,"Webster, Corey NYG CB"]
[1359,1359,"Weddle, Eric SDC S",202.4,12.65,10.5,12.8,6,15.6,18.75,11.25,"B",16.82,11.63,7.5,24.05,14.75,4.5,11.75,13.25,11.5,11.75,"Klingon Warriors",7,null,null,"Weddle, Eric SDC S"]
[1360,1360,"Weeden, Brandon CLE QB",146.36000000000001,9.7569999999999997,-9.08,24.7,4.4800000000000004,13,16.84,15.54,19.96,3.56,1.1399999999999999,"B",13.4,5.12,19.3,7.18,8.66,2.56,null,"I like my Women like I like my coffee, _______.",10,null,null,"Weeden, Brandon CLE QB"]
[1361,1361,"Weems, Eric CHI WR",13.54,0.84599999999999997,0,0,0,0,0,"B",1.08,0.12,0,0,0,4.75,3.65,2.36,0,1.58,0,"Free Agent",6,null,null,"Weems, Eric CHI WR"]
[1362,1362,"Welker, Wes NEP WR",331.41,20.713000000000001,5.15,15.75,25.2,22.08,32.979999999999997,37.83,16.18,12.3,"B",14.9,13.75,22.21,31.3,12.56,12.72,31,25.5,"Rancho Cucamonga Ghosts",9,null,null,"Welker, Wes NEP WR"]
[1363,1363,"Wells, Beanie ARI RB",53.8,6.7249999999999996,1.4,7.8,1.8,null,null,null,null,null,null,"B",null,16.8,2.2000000000000002,1.8,24.7,-2.7,null,"Free Agent",10,null,null,"Wells, Beanie ARI RB"]
[1364,1364,"Wendling, John DET S",24.75,1.5469999999999999,3.75,12.75,8.25,0,"B",0,0,0,0,0,0,0,0,0,0,0,0,"Free Agent",5,null,null,"Wendling, John DET S"]
[1365,1365,"Westerman, Jamaal IND LB",7.7,0.85599999999999998,null,null,0,"B",0,0,0,null,null,null,null,null,null,0,0,0,7.7,"Free Agent",4,null,null,"Westerman, Jamaal IND LB"]
[1366,1366,"Whalen, Ryan CIN WR",14.05,1.5609999999999999,null,null,null,null,null,null,8.1,"B",null,0,1.85,0,2.25,0,0,1.85,0,"Free Agent",8,null,null,"Whalen, Ryan CIN WR"]
[1367,1367,"Wheeler, Philip OAK LB",187.25,11.702999999999999,10.75,10.5,27,13.75,"B",13.5,4.5,23.7,8.5,9.75,6.75,14.05,7.25,11.25,17.5,6.25,2.25,"Klingon Warriors",5,null,null,"Wheeler, Philip OAK LB"]
[1368,1368,"White, Chris BUF LB",3,0.2,0,3,0,0,0,0,0,"B",0,0,0,0,0,0,0,null,0,"Free Agent",8,null,null,"White, Chris BUF LB"]
[1369,1369,"White, Corey NOS CB",51,5.0999999999999996,5.25,7.5,4.5,1.5,6.25,"B",1.5,5.25,5.25,14,null,null,0,null,null,null,null,"Free Agent (P)",6,null,null,"White, Corey NOS CB"]
[1370,1370,"White, Johnny FA RB",3.4,0.48599999999999999,null,1.1000000000000001,1.5,0.8,null,null,null,0,0,null,0,0,null,null,null,null,null,"Free Agent","-",null,null,"White, Johnny FA RB"]
[1371,1371,"White, Jordan NYJ WR",2.5499999999999998,1.2749999999999999,null,null,null,null,null,null,null,null,"B",null,null,0,null,null,null,null,2.5499999999999998,"Free Agent",9,null,null,"White, Jordan NYJ WR"]
[1372,1372,"White, Roddy ATL WR",300.54000000000002,18.783999999999999,16.2,26.2,11.75,44.28,11.8,20.7,"B",7.55,21.55,21.15,19.3,11.95,3.25,28.95,4.0999999999999996,41.36,10.45,"Roddy White Man Can't Jump (P)",7,null,null,"White, Roddy ATL WR"]
[1373,1373,"White, Tracy NEP LB",11.5,1.0449999999999999,0,0,0,1.5,0.75,null,null,null,"B",null,0,0.75,0,0,null,8.5,0,"Free Agent",9,null,null,"White, Tracy NEP LB"]
[1374,1374,"Whitehead, Tahir DET LB",3,0.214,null,3,0,0,"B",null,0,0,0,0,0,0,0,0,0,0,0,"Free Agent",5,null,null,"Whitehead, Tahir DET LB"]
[1375,1375,"Whitner, Donte SFO S",143.94999999999999,8.9969999999999999,7.75,4.5,10.5,6,4.5,6.5,3.75,10.5,"B",6,6.75,27.45,9.75,7,14.5,9.25,9.25,"Free Agent",9,null,null,"Whitner, Donte SFO S"]
[1376,1376,"Wilber, Kyle DAL LB",3.75,0.375,null,null,0,0,"B",0,null,null,0,2.5,0,0,1.25,null,0,null,0,"Free Agent (P)",5,null,null,"Wilber, Kyle DAL LB"]
[1377,1377,"Wilfork, Vince NEP DT",149.69999999999999,9.3559999999999999,3.5,8.25,10,12,5,3.75,15,2.5,"B",17.5,11.25,6.25,9.75,23.75,3.75,2.5,14.95,"Free Agent",9,null,null,"Wilfork, Vince NEP DT"]
[1378,1378,"Wilkerson, Muhammad NYJ DE",201,12.561999999999999,1.25,8.5,18.75,3.75,4.75,27.5,12.5,11.25,"B",24.75,18.05,3.75,11.7,14.3,12.5,20.2,7.5,"Hurry Up and Happy Birthday, Donny",9,null,null,"Wilkerson, Muhammad NYJ DE"]
[1379,1379,"Williams, Aaron BUF CB",59.5,5.4089999999999998,1.5,7,7.25,5.5,5.25,3,7,"B",5.25,null,null,null,null,null,4.5,0.75,12.5,"Free Agent",8,null,null,"Williams, Aaron BUF CB"]
[1380,1380,"Williams, Cary BAL CB",191.9,11.994,14,3,15,24.3,12.85,17.5,18.899999999999999,"B",19.100000000000001,10.25,3.25,7,10,7.75,16.5,11.75,0.75,"Klingon Warriors (P)",8,null,null,"Williams, Cary BAL CB"]
[1381,1381,"Williams, Corey DET DT",36.299999999999997,5.1859999999999999,18.55,9,0,null,"B",null,0,7,0,null,null,null,1.75,null,null,null,null,"Free Agent",5,null,null,"Williams, Corey DET DT"]
[1382,1382,"Williams, D.J. GBP TE",16.2,1.246,0,2.1,2.6,null,5,null,0,0,0,"B",0,0,0,0,null,6.5,0,"Free Agent",10,null,null,"Williams, D.J. GBP TE"]
[1383,1383,"Williams, DJ DEN LB",21.5,3.0710000000000002,null,null,null,null,null,null,"B",null,null,null,6.25,0,4,6.75,3,0,1.5,"Free Agent (Q)",7,null,null,"Williams, DJ DEN LB"]
[1384,1384,"Williams, Damian TEN WR",70.14,5.3949999999999996,9.5500000000000007,9.5,4.5,1.85,2.15,3.9,7.55,1.25,4.4000000000000004,5.6,"B",7.34,4.9000000000000004,null,null,7.65,null,"Free Agent",11,null,null,"Williams, Damian TEN WR"]
[1385,1385,"Williams, Dan ARI DT",104.25,6.95,5,0,4.5,5,6.25,1.25,2.5,2.5,12.5,"B",6.25,10.75,20.5,0,null,8.75,18.5,"Free Agent (P)",10,null,null,"Williams, Dan ARI DT"]
[1386,1386,"Williams, DeAngelo CAR RB",155.9,9.7439999999999998,1.4,12.9,9.3000000000000007,12.1,-2.4,"B",0.4,3.3,9.6999999999999993,3.3,1.8,2.1,7.8,20.2,20.399999999999999,6.8,46.8,"Derek's Daycare ",6,null,null,"Williams, DeAngelo CAR RB"]
[1387,1387,"Williams, Demorrio SDC LB",101.75,7.2679999999999998,4.5,3,0.75,7.5,3,2.25,"B",0,25.4,0.75,6.25,9.25,23.35,6,null,null,9.75,"Free Agent",7,null,null,"Williams, Demorrio SDC LB"]
[1388,1388,"Williams, Ian SFO DE",7.5,2.5,null,null,null,0,null,null,null,null,"B",null,null,null,null,null,null,0,7.5,"Free Agent",9,null,null,"Williams, Ian SFO DE"]
[1389,1389,"Williams, Jacquian NYG LB",44.1,4.41,6,0.75,2.25,3,0,9.1,null,null,null,null,"B",null,null,10.25,3.75,4.5,4.5,"Free Agent",11,null,null,"Williams, Jacquian NYG LB"]
[1390,1390,"Williams, Jason CAR LB",1.5,0.214,null,null,null,null,null,"B",null,0,null,null,null,null,0,0,0,1.5,0,"Free Agent",6,null,null,"Williams, Jason CAR LB"]
[1391,1391,"Williams, Keiland WAS RB",3.2,0.26700000000000002,1.6,0,0,1.5,null,0.1,null,null,0,"B",0,0,0,0,0,null,0,"Free Agent",10,null,null,"Williams, Keiland WAS RB"]
[1392,1392,"Williams, Kevin MIN DT",104.75,6.5469999999999997,4.5,4.25,7.5,3.75,13.75,8.75,13.9,0,10.75,13.35,"B",2,1.25,2.5,2.5,11,5,"Free Agent",11,null,null,"Williams, Kevin MIN DT"]
[1393,1393,"Williams, Kyle BUF DT",138.05000000000001,8.6280000000000001,6.25,19.850000000000001,13.55,16.8,7.5,2.5,18.3,"B",8.5,8.0500000000000007,4.75,3.75,6.75,8.75,2.5,2.5,7.75,"Free Agent (P)",8,null,null,"Williams, Kyle BUF DT"]
[1394,1394,"Williams, Kyle SFO WR",64.38,5.8529999999999998,1.63,0.53,11.46,1.9,16.899999999999999,13.64,3.35,1.65,"B",2.9,9.5,0.92,null,null,null,null,null,"Free Agent (P)",9,null,null,"Williams, Kyle SFO WR"]
[1395,1395,"Williams, LaQuan BAL WR",0.2,1.7999999999999999E-2,null,null,null,null,0,0,0.2,"B",0,0,0,0,0,0,0,0,null,"Free Agent",8,null,null,"Williams, LaQuan BAL WR"]
[1396,1396,"Williams, Madieu WAS S",159.35,9.9589999999999996,8.5,11.25,6.5,13,8.75,30.9,9.75,12,6,"B",3,7.75,8.25,4.5,3,14.2,12,"Free Agent",10,null,null,"Williams, Madieu WAS S"]
[1397,1397,"Williams, Mario BUF DE",195.35,12.209,2.5,9.5,17.600000000000001,5.5,5,20.9,3.75,"B",22.9,7.5,16.350000000000001,28.8,16.600000000000001,15.45,7.5,7.5,8,"Roddy White Man Can't Jump (P)",8,null,null,"Williams, Mario BUF DE"]
[1398,1398,"Williams, Mike TBB WR",239.35,14.959,9.6999999999999993,16.649999999999999,5.8,17.5,"B",23.3,8.6,20.3,17.8,9.9,6.65,7.55,23.8,11.55,11.3,28.95,20,"Invictus (P)",5,null,null,"Williams, Mike TBB WR"]
[1399,1399,"Williams, Ryan ARI RB",21.8,4.3600000000000003,1.6,1.3,10.5,3.6,4.8,null,null,null,null,"B",null,null,null,null,null,null,null,"Angry Neighbors (Q)",10,null,null,"Williams, Ryan ARI RB"]
[1400,1400,"Williams, Tramon GBP CB",137.05000000000001,8.5660000000000007,5.25,24.8,2.25,17.25,19,13.75,6.75,7,2.25,"B",3,6.25,7,6.5,1.5,7,7.5,"Free Agent (Q)",10,null,null,"Williams, Tramon GBP CB"]
[1401,1401,"Willis, Matt DEN WR",21.5,1.4330000000000001,2.65,2.65,0,null,0,0,"B",0,0,1.45,3.9,0,5.95,3.15,0,0,1.75,"Free Agent",7,null,null,"Willis, Matt DEN WR"]
[1402,1402,"Willis, Patrick SFO LB",203.1,12.694000000000001,7.5,15.25,13.75,19.75,13.5,13.5,16.25,12.25,"B",9.75,14.75,16.149999999999999,6,12,12,13.7,7,"BELAC (O)",9,null,null,"Willis, Patrick SFO LB"]
[1403,1403,"Wilson, Adrian ARI S",113.05,7.5369999999999999,10.3,3.75,null,31.9,1.5,5.25,10,3,5.25,"B",1.5,3,13.05,3,9.8000000000000007,3.5,8.25,"Free Agent",10,null,null,"Wilson, Adrian ARI S"]
[1404,1404,"Wilson, C.J. GBP DE",68.150000000000006,6.1950000000000003,7.5,null,5,10.45,5,13.7,6.75,2.5,6.25,"B",0,1.25,null,null,null,null,9.75,"Free Agent",10,null,null,"Wilson, C.J. GBP DE"]
[1405,1405,"Wilson, Chris WAS LB",12.3,0.76900000000000002,0,0,6.3,4.5,1.5,0,0,0,0,"B",0,0,0,0,0,0,0,"Free Agent",10,null,null,"Wilson, Chris WAS LB"]
[1406,1406,"Wilson, David NYG RB",139.52000000000001,8.7200000000000006,0.24,4.04,1.86,8.68,13.56,7.22,4.24,3.54,4,4.38,"B",5.68,4.22,38.08,10.24,12.38,17.16,"Hurry Up and Happy Birthday, Donny",11,null,null,"Wilson, David NYG RB"]
[1407,1407,"Wilson, George BUF S",141.75,8.859,6,8.5,9,14.25,9,8.25,13,"B",6.5,5.75,7.5,3.75,8.5,8.75,13.5,12.75,6.75,"Free Agent",8,null,null,"Wilson, George BUF S"]
[1408,1408,"Wilson, Jimmy MIA S",76.650000000000006,5.1100000000000003,1.5,2.5,0,3,5.5,6,"B",13.55,6.25,12.6,7,3,6.75,null,2.25,0,6.75,"Free Agent",7,null,null,"Wilson, Jimmy MIA S"]
[1409,1409,"Wilson, Josh WAS CB",167.07,10.442,11,11.5,11.5,12.5,15,6.75,15.02,7.5,3.5,"B",15.7,12,6,7,7.5,7.75,16.850000000000001,"Free Agent",10,null,null,{"$f":"IF(ISBLANK(C1419),\"\",C1419)","v":"Wilson, Josh WAS CB"}]
[1410,1410,"Wilson, Kyle NYJ CB",87.61,5.476,8,9.75,3,6,0,10,3,1.5,"B",4,7.93,7.93,8.25,6,3,3.75,5.5,"Free Agent",9,null,null,"Wilson, Kyle NYJ CB"]
[1411,1411,"Wilson, Martez NOS DE",48.8,3.05,2,0,1.5,1.5,13.9,"B",0,0,10.35,7.8,7,0,0,0,3.25,1.5,0,"Free Agent (P)",6,null,null,"Wilson, Martez NOS DE"]
[1412,1412,"Wilson, Russell SEA QB",265.72000000000003,16.608000000000001,4.32,11.84,17,-3.2,7.04,26.42,0.88,17.34,22.52,12.92,"B",20.76,28.82,9.1199999999999992,40.4,26.74,22.8,"The Black Champion",11,null,null,"Wilson, Russell SEA QB"]
[1413,1413,"Wilson, Tavon NEP S",94.45,5.9029999999999996,15.25,2.5,3,15.95,11.25,4,3,16.5,"B",1.5,11,0,1.5,0.75,0,6,2.25,"Free Agent",9,null,null,"Wilson, Tavon NEP S"]
[1414,1414,"Wimbley, Kamerion TEN DE",101.6,6.35,14.3,3.75,3.75,0,1.75,1.25,22.9,9.4499999999999993,9.4,0,"B",13.35,1.25,0,6.25,2.5,11.7,"Free Agent",11,null,null,"Wimbley, Kamerion TEN DE"]
[1415,1415,"Winfield, Antoine MIN CB",192.7,12.044,6,13,12.5,17,13.85,21.75,21.75,7.75,6,15.5,"B",21.1,10.5,9.5,7,9.5,0,"Free Agent",11,null,null,"Winfield, Antoine MIN CB"]
[1416,1416,"Winn, Billy CLE DT",83.35,5.2089999999999996,3.75,0,5,13.5,5,3.25,1.75,11.1,2.5,"B",2.5,14.5,0,6.25,9.25,2.5,2.5,"Free Agent",10,null,null,"Winn, Billy CLE DT"]
[1417,1417,"Winslow, Kellen FA TE",2.7,2.7,null,null,2.7,null,null,null,null,null,null,null,null,null,null,null,null,null,null,"Free Agent (P)","-",null,null,"Winslow, Kellen FA TE"]
[1418,1418,"Witherspoon, Will TEN LB",86.44,6.1740000000000004,3,21.95,11.5,6,1.25,0,2.25,null,null,0.75,"B",0,6,26,0,7.74,0,"Free Agent",11,null,null,"Witherspoon, Will TEN LB"]
[1419,1419,"Witten, Jason DAL TE",290.24,18.14,4,11.8,3.8,36.700000000000003,"B",17.8,13.4,47.04,15.6,16.7,15.6,20.9,19.8,12.2,17.8,15,22.1,"Hurry Up and Happy Birthday, Donny",5,null,null,"Witten, Jason DAL TE"]
[1420,1420,"Wolfe, Derek DEN DE",129.1,8.0690000000000008,14.4,0,8,4.25,13.8,14.4,"B",5,12.5,2.5,0,7.5,6.75,0,15.95,10.050000000000001,14,"Klingon Warriors",7,null,null,"Wolfe, Derek DEN DE"]
[1421,1421,"Woodhead, Danny NEP RB",157.41999999999999,9.8390000000000004,2,4,11.3,10.3,8.1999999999999993,13.82,8.6,10.9,"B",22.1,0,2.9,5.9,4.8,25.4,12.5,14.7,"Rancho Cucamonga Ghosts (P)",9,null,null,"Woodhead, Danny NEP RB"]
[1422,1422,"Woodley, LaMarr PIT LB",92.45,7.1120000000000001,5.5,9.6,13.7,"B",0,null,11.6,4,12,10.5,14.3,0,null,null,3,2.25,6,"Free Agent",4,null,null,"Woodley, LaMarr PIT LB"]
[1423,1423,"Woods, Al PIT DE",5,0.41699999999999998,0,0,0,"B",2.5,1.25,1.25,0,0,0,0,0,0,null,null,null,null,"Free Agent",4,null,null,"Woods, Al PIT DE"]
[1424,1424,"Woodson, Charles GBP S",77.25,11.036,18.5,12.75,5.5,16.75,16.25,1.5,6,null,null,"B",null,null,null,null,null,null,null,"Free Agent",10,null,null,"Woodson, Charles GBP S"]
[1425,1425,"Woodyard, Wesley DEN LB",219.7,14.647,25.5,8.25,9.6999999999999993,9.35,16,11.25,"B",38,13.5,6,23.25,23.15,2.25,null,9.25,19,5.25,"BELAC",7,null,null,"Woodyard, Wesley DEN LB"]
[1426,1426,"Wootton, Corey CHI DE",114.15,7.1340000000000003,11.5,9.75,0,0,16.149999999999999,"B",3.75,7.5,9.3000000000000007,3.75,7.05,3.75,2.5,13.4,20.75,5,0,"Free Agent",6,null,null,"Wootton, Corey CHI DE"]
[1427,1427,"Worilds, Jason PIT LB",68,4.25,9.8000000000000007,0,3,"B",13.5,11.1,0,1.5,0,0,0,21.6,4.5,2.25,0.75,0,0,"Free Agent",4,null,null,"Worilds, Jason PIT LB"]
[1428,1428,"Worthy, Jerel GBP DE",53.05,3.7890000000000001,0,14.9,0,3.75,2.5,15.5,0,0,null,"B",0,2.5,0,0,11.4,null,2.5,"Free Agent (O)",10,null,null,"Worthy, Jerel GBP DE"]
[1429,1429,"Wright, Eric TBB CB",94.75,9.4749999999999996,11,23.25,10,4.25,"B",10.25,16.25,8.5,5.25,1.5,4.5,null,null,null,null,null,null,"Free Agent (Q)",5,null,null,"Wright, Eric TBB CB"]
[1430,1430,"Wright, Jarius MIN WR",73.599999999999994,10.513999999999999,null,null,null,null,null,null,null,null,null,17.55,"B",13.65,2.5499999999999998,5.4,2.35,12.35,19.75,"Free Agent (Q)",11,null,null,"Wright, Jarius MIN WR"]
[1431,1431,"Wright, K.J. SEA LB",155.19999999999999,10.347,13.5,11,16.5,7.5,6,12,14.75,16,0,null,"B",5.25,8.25,5.5,13.65,16.3,9,"Free Agent",11,null,null,"Wright, K.J. SEA LB"]
[1432,1432,"Wright, Kendall TEN WR",164,10.933,9.9499999999999993,10.9,9.85,15.6,17.850000000000001,14.6,5.65,15.7,5.5,8.15,"B",11.45,15.3,10.15,6.85,null,6.5,"Invictus",11,null,null,"Wright, Kendall TEN WR"]
[1433,1433,"Wright, Major CHI S",155.25,9.7029999999999994,9.75,7.75,21,21,5.5,"B",4,10.75,2.25,8,12,8.75,7.75,14.25,5.25,8,9.25,"Free Agent",6,null,null,"Wright, Major CHI S"]
[1434,1434,"Wright, Shareece SDC CB",23,2.2999999999999998,0,null,null,null,null,null,"B",null,1.5,2.5,6,5.5,4.5,1.5,0,0,1.5,"Free Agent",7,null,null,"Wright, Shareece SDC CB"]
[1435,1435,"Wylie, Devon KCC WR",22.17,3.6949999999999998,0,null,null,null,null,null,"B",null,null,2.72,0,null,null,null,2.72,9.64,7.09,"Free Agent",7,null,null,"Wylie, Devon KCC WR"]
[1436,1436,"Wynn, Jarius TEN DE",31.4,4.4859999999999998,null,null,null,null,null,null,null,null,null,11.8,"B",0,2.5,11.1,0,3.5,2.5,"Free Agent",11,null,null,"Wynn, Jarius TEN DE"]
[1437,1437,"Yates, T.J. HOU QB",0.42,0.105,null,null,0,null,null,-2.08,null,"B",null,null,null,null,null,6.7,null,-4.2,null,"Free Agent",8,null,null,"Yates, T.J. HOU QB"]
[1438,1438,"Yeatman, Will MIA TE",0,0,null,null,null,null,null,null,"B",null,null,null,null,null,null,0,0,0,0,"Free Agent",7,null,null,"Yeatman, Will MIA TE"]
[1439,1439,"Young, Darrel WAS RB",37.9,2.3690000000000002,0.3,0,0,6,0,7.6,4.2,1,0.3,"B",8.6,0,3.3,3.8,2.8,0,0,"Free Agent",10,null,null,"Young, Darrel WAS RB"]
[1440,1440,"Young, Titus DET WR",107.15,10.715,3.75,2.35,22,3.45,"B",3.1,15.6,34.25,4.5,14.5,3.65,null,null,null,null,null,null,"Free Agent",5,null,null,"Young, Titus DET WR"]
[1441,1441,"Young, Usama CLE S",115.3,8.8689999999999998,null,0,9,11.85,23.15,10.5,5.25,13.25,7,"B",7.05,5.75,null,3,6,13.5,null,"Free Agent",10,null,null,"Young, Usama CLE S"]
[1442,1442,"Young, Willie DET DE",25,1.5620000000000001,0,0,0,1.25,"B",0,2.5,2.5,0,0,6.25,2.5,0,0,5,0,5,"Free Agent",5,null,null,"Young, Willie DET DE"]
[1443,1443,"Zbikowski, Tom IND S",79.77,7.2519999999999998,8.5,2.25,3.75,"B",6.25,6,7.25,6,5.83,12.7,5.74,15.5,null,null,null,null,null,"Free Agent",4,null,null,"Zbikowski, Tom IND S"]
[1444,1444,"Zombo, Frank GBP LB",7.5,1.071,null,null,null,null,null,null,null,null,null,"B",0.75,3,0,3.75,0,0,0,"Free Agent",10,null,null,"Zombo, Frank GBP LB"]
[1445,1445,"Zuerlein, Greg STL PK",106.5,6.6559999999999997,12,11.5,8,18,6.5,5.5,10,1,"B",6,1,4,9,1,2,4,7,"Free Agent",9,null,null,"Zuerlein, Greg STL PK"]
[null,null,null,null,null,null,null,null,null,null,null,null,null,null,null,null,null,null,null,null,null,null,null,null,null,null,""]
["Back To Top Of Page",null,null,null,null,null,null,null,null,null,null,null,null,null,null,null,null,null,null,null,null,null,null,null,null,null,""]
["Page Generated Sat Aug 17 11:58:38 a.m. PT 2013",null,null,null,null,null,null,null,null,null,null,null,null,null,null,null,null,null,null,null,null,null,null,null,null,null,""]
["Copyright © 1995-2013 Sideline Software, Inc. All Rights Reserved. Privacy Policy - Terms Of Service - Acceptable Use Policy - Statistical Information provided by: STATS LLC",null,null,null,null,null,null,null,null,null,null,null,null,null,null,null,null,null,null,null,null,null,null,null,null,null,""]
["Disclaimer: This site is not in any way affiliated with, endorsed or licensed by the National Football League, any NFL team or NFLPA member.",null,null,null,null,null,null,null,null,null,null,null,null,null,null,null,null,null,null,null,null,null,null,null,null,null,""]
[null,null,null,null,null,null,null,null,null,null,null,null,null,null,null,null,null,null,null,null,null,null,null,null,null,null,""]
[null,null,null,null,null,null,null,null,null,null,null,null,null,null,null,null,null,null,null,null,null,null,null,null,null,null,""]
[null,null,null,null,null,null,null,null,null,null,null,null,null,null,null,null,null,null,null,null,null,null,null,null,null,null,""]
[null,null,null,null,null,null,null,null,null,null,null,null,null,null,null,null,null,null,null,null,null,null,null,null,null,null,""]
[null,null,null,null,null,null,null,null,null,null,null,null,null,null,null,null,null,null,null,null,null,null,null,null,null,null,""]
[null,null,null,null,null,null,null,null,null,null,null,null,null,null,null,null,null,null,null,null,null,null,null,null,null,null,""]
[null,null,null,null,null,null,null,null,null,null,null,null,null,null,null,null,null,null,null,null,null,null,null,null,null,null,""]
[null,null,null,null,null,null,null,null,null,null,null,null,null,null,null,null,null,null,null,null,null,null,null,null,null,null,""]
[null,null,null,null,null,null,null,null,null,null,null,null,null,null,null,null,null,null,null,null,null,null,null,null,null,null,""]
[null,null,null,null,null,null,null,null,null,null,null,null,null,null,null,null,null,null,null,null,null,null,null,null,null,null,""]
[null,null,null,null,null,null,null,null,null,null,null,null,null,null,null,null,null,null,null,null,null,null,null,null,null,null,{"$f":"IF(ISBLANK(C1471),\"\",C1471)","v":""}]

{"sheet":"Release Notes","index":3,"n_rows":21,"n_cols":3,"rows_kept":21,"cut":false,"hidden":false,"merged":[[1,1,1,15],[3,1,10,15]]}
[]
[null,"Release Notes"]
[]
[null,"Thank you for taking your time to dig a little deeper into the F.lexible A.uction D.raft S.trategy (FADS) worksheet. The strategy was outlined in June of 2012 in an article found here (http://dynastyleaguefootball.com/2012/developing-a-flexible-auction-draft-strategy-fads-worksheet) and the FADS worksheet was released to the public in March of 2013 in an article found here (http://dynastyleaguefootball.com/2013/03/02/fads-worksheet-now-available/). At it's core the FADS worksheet aims to demystify the valuation of players from one league format to another. The strategy takes into account player performance, league scoring settings, league salary cap set-up, number of starting players, number of bench players, roster size in general, how individual players perform together as a team and the owner's own approach to team building. FADS is the most complete, fully-functioned and flexible austion bidding system available in fantasy football. Below are the improvements we've made to FADS with each new version. As you can see the best auction bidding system in fantasy football just keeps getting better:"]
[]
[]
[]
[]
[]
[]
[]
[]
[null,"Version 2.0:"]
[null,null,"• New \"Sideline\" theme deployed to keep FADS in line with current and future applications"]
[null,null,"• Users can now obtain bid amounts for bench players"]
[null,null,"• Minimum start bid per player are now accounted for"]
[null,null,"• FADS now auto-fills several fields which required user input in version 1.0"]
[null,null,"• Users are now given a visual cue as to which player rows must be filled out with the \"Pick?\" column"]
[null,null,"• Players can now see how much they can spend, on average, for the remaining starting players, bench players and all players overall"]
[null,null,"• FADS now displays starting and bench players percentage of team points vs. salary allocation"]
[null,null,"• Player dropdown list is now sorted alphabetically"]